{"text_format":"1","workbook":"xlsx","n_sheets":8,"sheets":["Instructions","RI DOT Construction Items","Quantities","BlueBook - DO NOT EDIT","UOMs - DO NOT EDIT","IMP Types - DO NOT EDIT","Items","LOOK UP - DO NOT DELETE"],"not_rendered":{"charts":0,"images":1,"macros":1,"external_links":0,"defined_names":3,"comments":1,"pivot_tables":0},"unopened":[],"bounds":{"document_bytes":16777216,"sheet_cells":100000,"rows_first":2000,"rows_last":500,"rows_between":2000,"halvings":0,"cell_chars":16384,"cell_head_chars":4096},"cells_cut":0,"cells_raw":0,"read":"whole","date_system":"1900"}

{"sheet":"Instructions","index":0,"n_rows":7,"n_cols":3,"rows_kept":7,"cut":false,"hidden":true,"merged":[]}
[]
[]
[null,"No.","Instruction "]
[null,1,"Do not modify the format of the template."]
[null,2,"Only input data in the defined cells."]
[null,3,"Do not refresh the page while the upload is in progress."]
[null,4,"Please select appropriate action to import item."]

{"sheet":"RI DOT Construction Items","index":1,"n_rows":6,"n_cols":12,"rows_kept":6,"cut":false,"hidden":false,"merged":[[0,0,0,5]]}
[]
["Item Type","Item Specification Number","Item Short Description*","Requested Quantity*","Estimated \nUnit Price","UOM","FAP Number","Federal %","State %","Other %","Allocation Total","IMP Type"]
["Standard","905.1000",{"$f":"IFERROR(IF(Table34[[#This Row],[Item Type]]=\"Standard\", VLOOKUP(Table34[[#This Row],[Item Specification Number]], BlueBook[],2,0),\"\"), \"Item Not Found, Check your code\")","v":"PORTLAND CEMENT CONCRETE SIDEWALKS AND DRIVEWAYS"},1,232,{"$f":"IFERROR(IF(Table34[[#This Row],[Item Type]]=\"Standard\", VLOOKUP(Table34[[#This Row],[Item Specification Number]], BlueBook[],3,0),\"\"), \"\")","v":"SY"},"BHO-013B(001)",0.9,0.1,0,{"$f":"Table34[[#This Row],[Federal %]]+Table34[[#This Row],[State %]]+Table34[[#This Row],[Other %]]","v":1},6]
["Standard","209.0200",{"$f":"IFERROR(IF(Table34[[#This Row],[Item Type]]=\"Standard\", VLOOKUP(Table34[[#This Row],[Item Specification Number]], BlueBook[],2,0),\"\"), \"Item Not Found, Check your code\")","v":"SACK INSERT CATCH BASIN INLET PROTECTION"},2,123.43,{"$f":"IFERROR(IF(Table34[[#This Row],[Item Type]]=\"Standard\", VLOOKUP(Table34[[#This Row],[Item Specification Number]], BlueBook[],3,0),\"\"), \"\")","v":"EACH"},"BHO-013B(001)",0.9,0.1,0,{"$f":"Table34[[#This Row],[Federal %]]+Table34[[#This Row],[State %]]+Table34[[#This Row],[Other %]]","v":1},4]
["Standard","201.0402",{"$f":"IFERROR(IF(Table34[[#This Row],[Item Type]]=\"Standard\", VLOOKUP(Table34[[#This Row],[Item Specification Number]], BlueBook[],2,0),\"\"), \"Item Not Found, Check your code\")","v":"REMOVE AND DISPOSE CONCRETE CURB"},1,323.33,{"$f":"IFERROR(IF(Table34[[#This Row],[Item Type]]=\"Standard\", VLOOKUP(Table34[[#This Row],[Item Specification Number]], BlueBook[],3,0),\"\"), \"\")","v":"LF"},"BHO-013B(001)",0.9,0.1,0,{"$f":"Table34[[#This Row],[Federal %]]+Table34[[#This Row],[State %]]+Table34[[#This Row],[Other %]]","v":1},4]
["Job Specification","T20.9906","Training sessions Job Spec item - Changed","10",324.22000000000003,"PBAG","BHO-013C(001)",0.8,0.2,0,{"$f":"Table34[[#This Row],[Federal %]]+Table34[[#This Row],[State %]]+Table34[[#This Row],[Other %]]","v":1},8]

{"sheet":"Quantities","index":2,"n_rows":11,"n_cols":4,"rows_kept":11,"cut":false,"hidden":false,"merged":[]}
["Line Item Number \n[Referencing RI DOT \nConstruction Items Sheet] ","Location","Station","Sub-Quantity *"]
[1,"Location 1","Station 1",55]
[1,"Location 1","Station 2",23]
[1,"Location 1","Station 3",20]
[1,"Location 1","Station 4",15]
[1,"Location 1","Station 5",5]
[2,"Location 2 ","Station 1",10]
[2,"Location 2 ","Station 2",20]
[2,"Location 2 ","Station 3",30]
[2,"Location 2 ","Station 4",40]
[2,"Location 2 ","Station 5",50]

{"sheet":"BlueBook - DO NOT EDIT","index":3,"n_rows":2041,"n_cols":3,"rows_kept":2041,"cut":false,"hidden":false,"merged":[]}
["Item Code","Title","UOM"]
["201.0301","CUTTING AND DISPOSING ISOLATED TREES AND STUMPS (4\"- 24\")","EACH"]
["201.0302","CUTTING AND DISPOSING ISOLATED TREES AND STUMPS (24'' OR PLUS)","EACH"]
["201.0304","PARTIAL REMOVAL OF STUMPS TO  6'' BELOW FINAL GROUND LEVEL","EACH"]
["201.0305","COMPLETE REMOVAL AND DISPOSAL OF ISOLATED STUMPS (6'' TO 24'')","EACH"]
["201.0306","COMPLETE REMOVAL AND DISPOSAL OF ISOLATED STUMPS (24'' OR PLUS)","EACH"]
["201.0310","REMOVE AND DISPOSE SHRUBS","EACH"]
["201.0320","CLEARING AND GRUBBING","ACRE"]
["201.0321","CLEARING AND GRUBBING","SY"]
["201.0322","CLEARING AND GRUBBING","HSY"]
["201.0401","REMOVE AND DISPOSE GRANITE CURB","LF"]
["201.0402","REMOVE AND DISPOSE CONCRETE CURB","LF"]
["201.0403","REMOVE AND DISPOSE SIDEWALKS","SY"]
["201.0404","REMOVE AND DISPOSE REINFORCED CONCRETE CULVERTS","EACH"]
["201.0405","REMOVE AND DISPOSE MASONRY","CY"]
["201.0406","REMOVE AND DISPOSE HIGHWAY BOUNDS","EACH"]
["201.0407","REMOVE AND DISPOSE PAVEMENT AND RIGID BASE","SY"]
["201.0408","REMOVE AND DISPOSE RIGID PAVEMENT","SY"]
["201.0409","REMOVE AND DISPOSE FLEXIBLE PAVEMENT","SY"]
["201.0410","REMOVE AND DISPOSE CATCH BASINS","EACH"]
["201.0411","REMOVE AND DISPOSE CATCH BASIN AND GUTTER INLETS","EACH"]
["201.0412","REMOVE AND DISPOSE MANHOLE","EACH"]
["201.0413","REMOVE AND DISPOSE RISERS","EACH"]
["201.0414","REMOVE AND DISPOSE PIPE - ALL SIZES","LF"]
["201.0415","REMOVE AND DISPOSE GUARDRAIL AND POST ALL TYPES","LF"]
["201.0416","REMOVE AND DISPOSE LOT CURB (ALL SIZES)","LF"]
["201.0418","REMOVE AND DISPOSE HYDRANT","EACH"]
["201.0419","REMOVE AND DISPOSE FENCE","LF"]
["201.0420","REMOVE AND DISPOSE CONCRETE SLAB","SY"]
["201.0421","REMOVE AND DISPOSE BITUMINOUS CURB","LF"]
["201.0422","REMOVE AND DISPOSE DROP INLET","EACH"]
["201.0423","REMOVE AND DISPOSE HANDHOLE","EACH"]
["201.0424","REMOVE AND DISPOSE RETAINING WALL","CY"]
["201.0425","REMOVE AND DISPOSE FLARED END SECTION","EACH"]
["201.0426","REMOVE AND DISPOSE PRIVATE SIGN","EACH"]
["201.0427","REMOVE AND DISPOSE CONCRETE CAR STOPS","EACH"]
["201.0428","REMOVE AND DISPOSE FRAME AND GRATE OR FRAME AND COVER","EACH"]
["201.0429","REMOVE AND DISPOSE CURB STOP BOX","EACH"]
["201.0430","REMOVE AND DISPOSE CONCRETE MEDIAN BARRIER","LF"]
["201.0431","REMOVE AND DISPOSE CONCRETE MEDIAN MARKER","SY"]
["201.0432","REMOVE AND DISPOSE HEADWALL","EACH"]
["201.0433","REMOVE AND DISPOSE BOLLARD","EACH"]
["201.0434","REMOVE AND DISPOSE MONITORING/OBSERVATION WELL","EACH"]
["201.0440","REMOVE AND DISPOSE ASBESTOS CEMENT PIPE/ DUCT (TRANSITE) ALL TYPES AND SIZES","LF"]
["201.0450","REMOVE AND STOCKPILE ON SITE GRANITE CURB","LF"]
["201.0451","REMOVE AND STOCKPILE ON SITE CONCRETE CURB","LF"]
["201.0452","REMOVE AND STOCKPILE ON SITE HIGHWAY BOUNDS","EACH"]
["201.0453","REMOVE AND STOCKPILE ON SITE FRAME GRATES AND COVERS","EACH"]
["201.0454","REMOVE AND STOCKPILE ON SITE GUARD RAIL ALL TYPES INCLUDING END SECTIONS","LF"]
["201.0455","REMOVE AND STOCKPILE ON SITE SIGN PANELS","EACH"]
["201.0457","REMOVE AND STOCKPILE ON SITE HYDRANT","EACH"]
["201.0458","REMOVE AND DISPOSE PIPE PLUGS ALL SIZES","EACH"]
["201.0500","DEMOLITION OF BUILDINGS","EACH"]
["201.0601","REMOVE AND DISPOSE GROUND MOUNTED SIGNS","EACH"]
["201.0602","REMOVE AND STOCKPILE GROUND MOUNTED SIGNS","EACH"]
["201.0603","REMOVE AND SALVAGE GROUND MOUNTED SIGNS","EACH"]
["201.0604","REMOVE AND DISPOSE GROUND MOUNTED SIGN POSTS","EACH"]
["201.0605","REMOVE AND DISPOSE GROUND MOUNTED SIGN BASES","EACH"]
["201.0606","REMOVE AND STOCKPILE GROUND MOUNTED SIGN STRUCTURE","EACH"]
["201.0607","REMOVE AND STOCKPILE GROUND MOUNTED SIGN PANEL","EACH"]
["201.0608","REMOVE AND STOCKPILE DIRECTIONAL REGULATORY AND WARNING SIGNS","EACH"]
["201.0609","REMOVE AND SALVAGE DIRECTIONAL REGULATORY AND WARNING SIGNS","EACH"]
["201.0610","REMOVE AND DISPOSE DIRECTIONAL, WARNING, REGULATORY, SERVICE, AND STREET SIGNS","EACH"]
["201.0611","REMOVE AND STOCKPILE OVERHEAD SIGN STRUCTURE","EACH"]
["201.0612","REMOVE AND STOCKPILE OVERHEAD SIGN PANEL","EACH"]
["201.0613","REMOVE AND STOCKPILE LIGHT STANDARDS","EACH"]
["201.0614","REMOVE AND STOCKPILE HANDHOLES - TYPE A","EACH"]
["201.0615","REMOVE AND STOCKPILE LUMINAIRE","EACH"]
["201.0616","REMOVE AND DISPOSE LIGHT STANDARD FOUNDATIONS","EACH"]
["201.0617","REMOVE AND DISPOSE CONDUIT - ALL SIZES","LF"]
["201.0622","REMOVE AND DISPOSE OVERHEAD SIGN PANEL","EACH"]
["201.0623","REMOVE AND DISPOSE OVERHEAD SIGN STRUCTURE","EACH"]
["201.0700","LOAD AND HAUL SALVAGED MATERIAL NON-PARTICIPATING","LS"]
["201.0710","LOAD AND HAUL SALVAGED MATERIAL","LS"]
["201.0720","LOAD AND HAUL SOLID WASTE","TON"]
["201.0730","DISPOSE SOLID WASTE","TON"]
["202.0100","EARTH EXCAVATION","CY"]
["202.0200","ROCK EXCAVATION COMMON","CY"]
["202.0201","ROCK EXCAVATION MECHANICAL","CY"]
["202.0204","PRESPLITTING BEDROCK","SY"]
["202.0300","UNCLASSIFIED EXCAVATION","CY"]
["202.0400","MUCK EXCAVATION","CY"]
["202.0450","UNSUITABLE SOILS","CY"]
["202.0500","CHANNEL EXCAVATION EARTH","CY"]
["202.0510","CHANNEL EXCAVATION ROCK","CY"]
["202.0511","CHANNEL EXCAVATION ROCK MECHANICAL","CY"]
["202.0530","CHANNEL EXCAVATION MUCK","CY"]
["202.0540","CHANNEL EXCAVATION UNCLASSIFIED","CY"]
["202.0550","WET EXCAVATION (BELOW MEAN HIGH WATER)","CY"]
["202.0600","LOAM EXCAVATION","CY"]
["202.0700","COMMON BORROW","CY"]
["202.0720","BORROW FROM STATE STOCKPILES","CY"]
["202.0730","SELECT BORROW","CY"]
["202.0800","GRAVEL BORROW","CY"]
["203.0100","STRUCTURAL EXCAVATION EARTH","CY"]
["203.0110","STRUCTURAL EXCAVATION EARTH DRY","CY"]
["203.0120","STRUCTURAL EXCAVATION EARTH WET (IN WATER)","CY"]
["203.0130","STRUCTURAL EXCAVATION MUCK","CY"]
["203.0201","HOLES FOR PRESPLITING","LF"]
["203.0202","STRUCTURAL EXCAVATION ROCK (EXCLUDING BOULDERS)","CY"]
["203.0203","STRUCTURAL EXCAVATION BOULDERS","CY"]
["203.0210","STRUCTURAL EXCAVATION ROCK","CY"]
["203.0220","STRUCTURAL EXCAVATION ROCK MECHANICAL","CY"]
["203.0310","STRUCUTRAL EXCAVATION MASONRY","CY"]
["203.0400","STRUCTURAL EXCAVATION UNCLASSIFIED","CY"]
["203.0410","STRUCTURAL EXCAVATION UNCLASSIFIED DRY","CY"]
["203.0420","STRUCTURAL EXCAVATION UNCLASSIFIED WET","CY"]
["203.0430","STRUCTURAL EXCAVATION UNCLASSIFIED EXCEPT HARD LEDGE","CY"]
["203.0440","STRUCTURAL EXCAVATION UNCLASSIFIED IN COFFERDAMS","CY"]
["203.0510","COFFERDAMS","LS"]
["203.0511","TREMIE SEALS","CY"]
["203.0520","CRIBS","LS"]
["203.0530","DEWATERING","LS"]
["203.0600","FILL GRAVEL BORROW UNDER STRUCTURES","CY"]
["203.0650","CRUSHED STONE FILL UNDER STRUCTURES","CY"]
["203.0700","PERVIOUS FILL","CY"]
["203.0800","VIBRATORY COMPACTION","SY"]
["204.0100","TRIMMING AND FINE GRADING","SY"]
["205.0240","TRENCH ROCK EXCAVATION (0-7')","CY"]
["205.0250","TRENCH ROCK EXCAVATION (7-12')","CY"]
["205.0260","TRENCH ROCK EXCAVATION (12'-D)","CY"]
["205.0270","TRENCH ROCK EXCAVATION-MECHANICAL (0-7')","CY"]
["205.0280","TRENCH ROCK EXCAVATION-MECHANICAL (7-12')","CY"]
["205.0290","TRENCH ROCK EXCAVATION-MECHANICAL (12'-D)","CY"]
["205.0700","TEMPORARY TIMBER SHEETING","SF"]
["205.0801","PERMANENT TIMBER SHEETING","SF"]
["205.0900","TEMPORARY STEEL SHEETING","SF"]
["205.0950","TEMPORARY STEEL SHEETING ABANDONED IN PLACE","SF"]
["205.1000","PERMANENT STEEL SHEETING","SF"]
["206.0210","BALED STRAW EROSION CHECK STANDARD 9.1.0","LF"]
["206.0211","REMOVAL OF BALED STRAW EROSION CHECKS","LF"]
["206.0220","SILT FENCE STANDARD 9.2.0","LF"]
["206.0240","BALED STRAW EROSION CHECK AND SILT FENCE COMBINED STANDARD 9.3.0","LF"]
["206.0301","COMPOST FILTER SOCK","LF"]
["206.0306","COMPOST FILTER SOCK 6 INCH DIAMETER","LF"]
["206.0312","COMPOST FILTER SOCK 12 INCH DIAMETER","LF"]
["206.0318","COMPOST FILTER SOCK 18 INCH DIAMETER","LF"]
["207.0206","SAND BAG EROSION DIKE STANDARD 9.6.0","PBAG"]
["207.0210","STONE CHECK DAMS","CF"]
["207.0300","COMPOST FILTER SOCK DITCH AND SWALE EROSION CHECK","LF"]
["207.0310","COMPOST FILTER SOCK CHECK DAMS","LF"]
["208.0100","DEWATERING BASIN STANDARD 9.7.0","SF"]
["208.0101","FILTER FABRIC RETENTION BASIN","SF"]
["209.0101","SILT FENCE CATCH BASIN INLET PROTECTION","LF"]
["209.0120","BALED STRAW CATCH BASIN INLET PROTECTION STANDARD 9.8.0","LF"]
["209.0200","SACK INSERT CATCH BASIN INLET PROTECTION","EACH"]
["209.0210","HIGH FLOW SACK INSERT CATCH BASIN INLET PROTECTION","EACH"]
["211.0100","CONSTRUCTION ACCESSES STANDARD 9.9.0","SY"]
["212.2100","MAINTENANCE AND CLEANING OF EROSION AND POLLUTION CONTROLS","LS"]
["213.0100","PLACEMENT OF MILLINGS BENEATH GUARDRAIL","LF"]
["214.0100","CONTAINMENT SYSTEM FOR CONTROL OF HYDRODEMOLITION RUNOFF","LS"]
["214.0200","MAINTENANCE & DISPOSAL OF HYDRODEMOLITION RUNOFF","PDAY"]
["301.0200","GRAVEL BORROW BASE COURSE","CY"]
["301.0201","SCREENED GRAVEL BASE COURSE","CY"]
["301.0202","GRAVEL BORROW BASE COURSE","TON"]
["301.0300","CRUSHED STONE OR CRUSHED GRAVEL BASE MODIFIED","CY"]
["301.0400","SCREENED GRAVEL BASE COURSE","TON"]
["301.0500","CRUSHED STONE OR CRUSHED GRAVEL BASE MODIFIED","TON"]
["302.0100","GRAVEL BORROW SUBBASE COURSE","CY"]
["303.0100","SPECIAL GRADED AGGREGATE FOR SHAPING AND TRIMMING DRIVEWAYS OR SHOULDERS","CY"]
["303.0200","SPECIAL GRADED AGGREGATE FOR SHAPING AND TRIMMING DRIVEWAYS OR SHOULDERS","TON"]
["304.0100","SELECT LEVELING AND FILLER AGGREGATE","CY"]
["401.1000","CLASS 19.0 HMA","TON"]
["401.1003","CLASS 19.0 HMA FOR PATCHING","TON"]
["401.1005","CLASS 19.0 HMA FOR MISCELLANEOUS WORK","TON"]
["401.1010","CLASS 19.0 HMA WITH PAY ADJUSTMENTS","TON"]
["401.1100","MODIFIED CLASS 19.0 HMA","TON"]
["401.1110","MODIFIED CLASS 19.0 HMA WITH PAY ADJUSTMENTS","TON"]
["401.1200","CLASS 19.0 HMA WITH WMA","TON"]
["401.1210","CLASS 19.0 HMA WITH WMA AND PAY ADJUSTMENTS","TON"]
["401.1300","MODIFIED CLASS 19.0 HMA WITH WMA","TON"]
["401.1310","MODIFIED CLASS 19.0 HMA WITH WMA AND PAY ADJUSTMENTS","TON"]
["401.2000","CLASS 12.5 HMA","TON"]
["401.2002","CLASS 12.5 HMA FOR LEVELLING","TON"]
["401.2003","CLASS 12.5 HMA FOR PATCHING","TON"]
["401.2004","CLASS 12.5 HMA FOR PAVED WATERWAYS","TON"]
["401.2005","CLASS 12.5 HMA FOR MISCELLANEOUS WORK","TON"]
["401.2010","CLASS 12.5 HMA WITH PAY ADJUSTMENTS","TON"]
["401.2100","MODIFIED CLASS 12.5 HMA","TON"]
["401.2110","MODIFIED CLASS 12.5 HMA WITH PAY ADJUSTMENTS","TON"]
["401.2200","CLASS 12.5 HMA WITH WMA","TON"]
["401.2210","CLASS 12.5 HMA WITH WMA AND PAY ADJUSTMENTS","TON"]
["401.2300","MODIFIED CLASS 12.5 HMA WITH WMA","TON"]
["401.2310","MODIFIED CLASS 12.5 HMA WITH WMA AND PAY ADJUSTMENTS","TON"]
["401.3000","CLASS 9.5 HMA","TON"]
["401.3002","CLASS 9.5 HMA FOR LEVELLING","TON"]
["401.3003","CLASS 9.5 HMA FOR PATCHING","TON"]
["401.3004","CLASS 9.5 HMA FOR PAVED WATERWAYS","TON"]
["401.3005","CLASS 9.5 HMA FOR MISCELLANEOUS WORK","TON"]
["401.3010","CLASS 9.5 HMA WITH PAY ADJUSTMENTS","TON"]
["401.3100","MODIFIED CLASS 9.5 HMA","TON"]
["401.3101","MODIFIED CLASS 9.5 HMA FOR BRIDGE DECKS","TON"]
["401.3110","MODIFIED CLASS 9.5 HMA WITH PAY ADJUSTMENTS","TON"]
["401.3111","MODIFIED CLASS 9.5 HMA FOR BRIDGE DECKS WITH PAY ADJUSTMENTS","TON"]
["401.3200","CLASS 9.5 HMA WITH WMA","TON"]
["401.3210","CLASS 9.5 HMA WITH WMA AND PAY ADJUSTMENTS","TON"]
["401.3300","MODIFIED CLASS 9.5 HMA WITH WMA","TON"]
["401.3301","MODIFIED CLASS 9.5 HMA FOR BRIDGE DECKS WITH WMA","TON"]
["401.3310","MODIFIED CLASS 9.5 HMA WITH WMA AND PAY ADJUSTMENTS","TON"]
["401.3311","MODIFIED CLASS 9.5 HMA FOR BRIDGE DECKS WITH WMA AND PAY ADJUSTMENTS","TON"]
["401.4000","CLASS 4.75 HMA","TON"]
["401.4002","CLASS 4.75 HMA FOR LEVELLING","TON"]
["401.4003","CLASS 4.75 HMA FOR PATCHING","TON"]
["401.4005","CLASS 4.75 HMA FOR MISCELLANEOUS WORK","TON"]
["401.4010","CLASS 4.75 HMA WITH PAY ADJUSTMENTS","TON"]
["401.4100","MODIFIED CLASS 4.75 HMA","TON"]
["401.4110","MODIFIED CLASS 4.75 HMA WITH PAY ADJUSTMENTS","TON"]
["401.4200","CLASS 4.75 HMA WITH WMA","TON"]
["401.4210","CLASS 4.75 HMA WITH WMA AND PAY ADJUSTMENTS","TON"]
["401.4300","MODIFIED CLASS 4.75 HMA WITH WMA","TON"]
["401.4310","MODIFIED CLASS 4.75 HMA WITH WMA AND PAY ADJUSTMENTS","TON"]
["402.0870","DENSE FRICTION COURSE","TON"]
["402.0871","DENSE FRICTION COURSE WITH MATERIAL TRANSFER VEHICLE","TON"]
["402.0880","RAMP FRICTION COURSE","TON"]
["403.0300","ASPHALT EMULSION TACK COAT","SY"]
["404.0400","PRIME COAT","SY"]
["404.0500","BLOTTER MATERIAL FOR PRIME COAT","TON"]
["404.0501","BLOTTER MATERIAL FOR PRIME COAT","CY"]
["405.0100","BITUMINOUS MATERIAL FOR SEAL COAT","SY"]
["405.0200","COVER COAT MATERIAL FOR SEAL COAT CHIPSTONE 1/2","TON"]
["405.0201","COVER COAT MATERIAL FOR SEAL COAT","TON"]
["405.0202","COVER COAT MATERIAL FOR SEAL COAT","CY"]
["406.0100","COLD RECYCLED BASE COURSE","SY"]
["408.0300","CLEANING AND SEALING CRACKS IN BITUMINOUS CONCRETE PAVEMENT","LF"]
["409.0000","SAW & SEAL TRANSVERSE JOINTS IN BITUMINOUS CONCRETE PAVEMENT OVER RIGID BASE","LF"]
["410.1000","TEMPORARY PATCHING MATERIAL/TRENCHES","TON"]
["411.0100","PAVER PLACED ELASTOMERIC SURFACE TREATMENT","SY"]
["412.0100","RUBBERIZED ASPHALT CHIP SEALING","SY"]
["414.0100","WARM MIX ADDITIVE","EACH"]
["501.0100","PORTLAND CEMENT CONCRETE PAVEMENT (PLAIN)","SY"]
["501.0101","PORTLAND CEMENT CONCRETE PAVEMENT PLAIN (DRIVEWAYS)","SY"]
["501.0103","PORTLAND CEMENT CONCRETE BASE","SY"]
["501.0110","PORTLAND CEMENT CONCRETE PAVEMENT REINFORCED 8 INCHES","SY"]
["502.1000","FULL DEPTH CLEANING AND SEALING OF JOINTS AND CRACKS 2-1/2\" NOM. WIDTH OR LESS IN PCC PAVEMENT","LF"]
["503.1010","REPAIRING DETERIORATED/DAMAGED JOINTS 2 1/2\" TO 8\" NOM. WIDTH IN FINISHED PCC PAVEMENT","CF"]
["504.1000","PAVEMENT GROOVING","SY"]
["505.0100","CLASS X PORTLAND CEMENT CONCRETE BASE COURSE WITH CRACK CONTROL","SY"]
["601.0101","CLASS X PORTLAND CEMENT CONCRETE","CY"]
["601.0120","CLASS HP PORTLAND CEMENT CONCRETE","CY"]
["601.0200","CLASS XX PORTLAND CEMENT CONCRETE","CY"]
["601.0300","CLASS A PORTLAND CEMENT CONCRETE","CY"]
["601.0501","CLASS B  PORTLAND CEMENT CONCRETE","CY"]
["601.0600","CLASS Z  PORTLAND CEMENT CONCRETE","CY"]
["601.1000","TYPE IP CEMENT","CY"]
["601.2000","PORTLAND CEMENT CONCRETE WITH FLY ASH","CY"]
["603.1000","CONTROLLED LOW STRENGTH MATERIAL","CY"]
["701.0412","REINFORCED CONCRETE PIPE M 170 CLASS III 12 INCH","LF"]
["701.0415","REINFORCED CONCRETE PIPE M 170 CLASS III 15 INCH","LF"]
["701.0418","REINFORCED CONCRETE PIPE M 170 CLASS III 18 INCH","LF"]
["701.0421","REINFORCED CONCRETE PIPE M 170 CLASS III 21 INCH","LF"]
["701.0424","REINFORCED CONCRETE PIPE M 170 CLASS III 24 INCH","LF"]
["701.0427","REINFORCED CONCRETE PIPE M 170 CLASS III 27 INCH","LF"]
["701.0430","REINFORCED CONCRETE PIPE M 170 CLASS III 30 INCH","LF"]
["701.0433","REINFORCED CONCRETE PIPE M 170 CLASS III 33 INCH","LF"]
["701.0436","REINFORCED CONCRETE PIPE M 170 CLASS III 36 INCH","LF"]
["701.0442","REINFORCED CONCRETE PIPE M 170 CLASS III 42 INCH","LF"]
["701.0448","REINFORCED CONCRETE PIPE M 170 CLASS III 48 INCH","LF"]
["701.0454","REINFORCED CONCRETE PIPE M 170 CLASS III 54 INCH","LF"]
["701.0460","REINFORCED CONCRETE PIPE M 170 CLASS III 60 INCH","LF"]
["701.0466","REINFORCED CONCRETE PIPE M 170 CLASS III 66 INCH","LF"]
["701.0472","REINFORCED CONCRETE PIPE M 170 CLASS III 72 INCH","LF"]
["701.0478","REINFORCED CONCRETE PIPE M 170 CLASS III 78 INCH","LF"]
["701.0484","REINFORCED CONCRETE PIPE M 170 CLASS III 84 INCH","LF"]
["701.0490","REINFORCED CONCRETE PIPE M 170 CLASS III 90 INCH","LF"]
["701.0496","REINFORCED CONCRETE PIPE M 170 CLASS III 96 INCH","LF"]
["701.0497","REINFORCED CONCRETE PIPE M 170 CLASS III 102 INCH","LF"]
["701.0498","REINFORCED CONCRETE PIPE M 170 CLASS III 108 INCH","LF"]
["701.0512","REINFORCED CONCRETE PIPE M 170 CLASS IV 12 INCH","LF"]
["701.0515","REINFORCED CONCRETE PIPE M 170 CLASS IV 15 INCH","LF"]
["701.0518","REINFORCED CONCRETE PIPE M 170 CLASS IV 18 INCH","LF"]
["701.0521","REINFORCED CONCRETE PIPE M 170 CLASS IV 21 INCH","LF"]
["701.0524","REINFORCED CONCRETE PIPE M 170 CLASS IV 24 INCH","LF"]
["701.0527","REINFORCED CONCRETE PIPE M 170 CLASS IV 27 INCH","LF"]
["701.0530","REINFORCED CONCRETE PIPE M 170 CLASS IV 30 INCH","LF"]
["701.0533","REINFORCED CONCRETE PIPE M 170 CLASS IV 33 INCH","LF"]
["701.0536","REINFORCED CONCRETE PIPE M 170 CLASS IV 36 INCH","LF"]
["701.0542","REINFORCED CONCRETE PIPE M 170 CLASS IV 42 INCH","LF"]
["701.0548","REINFORCED CONCRETE PIPE M 170 CLASS IV 48 INCH","LF"]
["701.0554","REINFORCED CONCRETE PIPE M 170 CLASS IV 54 INCH","LF"]
["701.0560","REINFORCED CONCRETE PIPE M 170 CLASS IV 60 INCH","LF"]
["701.0566","REINFORCED CONCRETE PIPE M 170 CLASS IV 66 INCH","LF"]
["701.0572","REINFORCED CONCRETE PIPE M 170 CLASS IV 72 INCH","LF"]
["701.0578","REINFORCED CONCRETE PIPE M 170 CLASS IV 78 INCH","LF"]
["701.0584","REINFORCED CONCRETE PIPE M 170 CLASS IV 84 INCH","LF"]
["701.0590","REINFORCED CONCRETE PIPE M 170 CLASS IV 90 INCH","LF"]
["701.0596","REINFORCED CONCRETE PIPE M 170 CLASS IV 96 INCH","LF"]
["701.0597","REINFORCED CONCRETE PIPE M 170 CLASS IV 102 INCH","LF"]
["701.0598","REINFORCED CONCRETE PIPE M 170 CLASS IV 108 INCH","LF"]
["701.0612","REINFORCED CONCRETE PIPE M 170 CLASS V 12 INCH","LF"]
["701.0615","REINFORCED CONCRETE PIPE M 170 CLASS V 15 INCH","LF"]
["701.0618","REINFORCED CONCRETE PIPE M 170 CLASS V 18 INCH","LF"]
["701.0621","REINFORCED CONCRETE PIPE M 170 CLASS V 21 INCH","LF"]
["701.0624","REINFORCED CONCRETE PIPE M 170 CLASS V 24 INCH","LF"]
["701.0627","REINFORCED CONCRETE PIPE M 170 CLASS V 27 INCH","LF"]
["701.0630","REINFORCED CONCRETE PIPE M 170 CLASS V 30 INCH","LF"]
["701.0633","REINFORCED CONCRETE PIPE M 170 CLASS V 33 INCH","LF"]
["701.0636","REINFORCED CONCRETE PIPE M 170 CLASS V 36 INCH","LF"]
["701.0642","REINFORCED CONCRETE PIPE M 170 CLASS V 42 INCH","LF"]
["701.0648","REINFORCED CONCRETE PIPE M 170 CLASS V 48 INCH","LF"]
["701.0654","REINFORCED CONCRETE PIPE M 170 CLASS V 54 INCH","LF"]
["701.0660","REINFORCED CONCRETE PIPE M 170 CLASS V 60 INCH","LF"]
["701.0666","REINFORCED CONCRETE PIPE M 170 CLASS V 66 INCH","LF"]
["701.0672","REINFORCED CONCRETE PIPE M 170 CLASS V 72 INCH","LF"]
["701.0678","REINFORCED CONCRETE PIPE M 170 CLASS V 78 INCH","LF"]
["701.0684","REINFORCED CONCRETE PIPE M 170 CLASS V 84 INCH","LF"]
["701.0690","REINFORCED CONCRETE PIPE M 170 CLASS V 90 INCH","LF"]
["701.0696","REINFORCED CONCRETE PIPE M 170 CLASS V 96 INCH","LF"]
["701.0697","REINFORCED CONCRETE PIPE M 170 CLASS V 102 INCH","LF"]
["701.0698","REINFORCED CONCRETE PIPE M 170 CLASS V 108 INCH","LF"]
["701.0704","4 INCH CONC DRAIN TILE M 178 STANDARD QUALITY","LF"]
["701.0705","5 INCH CONC DRAIN TILE M 178 STANDARD QUALITY","LF"]
["701.0706","6 INCH CONC DRAIN TILE M 178 STANDARD QUALTIY","LF"]
["701.0708","8 INCH CONC DRAIN TILE M 178 STANDARD QUALITY","LF"]
["701.0710","10 INCH CONC DRAIN TILE M 178 STANDARD QUALITY","LF"]
["701.0712","12 INCH CONC DRAIN TILE M 178 STANDARD QUALITY","LF"]
["701.0804","4 INCH CONC DRAIN TILE M 178 EXTRA QUALITY","LF"]
["701.0805","5 INCH CONC DRAIN TILE M 178 EXTRA QUALITY","LF"]
["701.0806","6 INCH CONC DRAIN TILE M 178 EXTRA QUALITY","LF"]
["701.0808","8 INCH CONC DRAIN TILE M 178 EXTRA QUALITY","LF"]
["701.0810","10 INCH CONC DRAIN TILE M 178 EXTRA QUALITY","LF"]
["701.0812","12 INCH CONC DRAIN TILE M 178 EXTRA QUALITY","LF"]
["701.0814","14 INCH CONC DRAIN TILE M 178 EXTRA QUALITY","LF"]
["701.0815","15 INCH CONC DRAIN TILE M 178 EXTRA QUALITY","LF"]
["701.0816","16 INCH CONC DRAIN TILE M 178 EXTRA QUALITY","LF"]
["701.0818","18 INCH CONC DRAIN TILE M 178 EXTRA QUALITY","LF"]
["701.0820","20 INCH CONC DRAIN TILE M 178 EXTRA QUALITY","LF"]
["701.0821","22 INCH CONC DRAIN TILE M 178 EXTRA QUALITY","LF"]
["701.0824","24 INCH CONC DRAIN TILE M 178 EXTRA QUALITY","LF"]
["701.0854","4 INCH CONC DRAIN TILE M 178 SPECIAL QUALITY","LF"]
["701.0855","5 INCH CONC DRAIN TILE M 178 SPECIAL QUALITY","LF"]
["701.0856","6 INCH CONC DRAIN TILE M 178 SPECIAL QUALITY","LF"]
["701.0858","8 INCH CONC DRAIN TILE M 178 SPECIAL QUALITY","LF"]
["701.0860","10 INCH CONC DRAIN TILE M 178 SPECIAL QUALITY","LF"]
["701.0862","12 INCH CONC DRAIN TILE M 178 SPECIAL QUALITY","LF"]
["701.0864","14 INCH CONC DRAIN TILE M 178 SPECIAL QUALITY","LF"]
["701.0865","15 INCH CONC DRAIN TILE M 178 SPECIAL QUALITY","LF"]
["701.0866","16 INCH CONC DRAIN TILE M 178 SPECIAL QUALITY","LF"]
["701.0868","18 INCH CONC DRAIN TILE M 178 SPECIAL QUALITY","LF"]
["701.0870","20 INCH CONC DRAIN TILE M 178 SPECIAL QUALITY","LF"]
["701.0871","22 INCH CONC DRAIN TILE M 178 SPECIAL QUALITY","LF"]
["701.0874","24 INCH CONC DRAIN TILE M 178 SPECIAL QUALITY","LF"]
["701.2012","12'' BCCMCP M190 TYPE A W/BENDS AND BANDS","LF"]
["701.2015","15'' BCCMCP M190 TYPE A W/BENDS AND BANDS","LF"]
["701.2018","18'' BCCMCP M190 TYPE A W/BENDS AND BANDS","LF"]
["701.2021","21'' BCCMCP M190 TYPE A W/BENDS AND BANDS","LF"]
["701.2024","24'' BCCMCP M190 TYPE A W/BENDS AND BANDS","LF"]
["701.2030","30'' BCCMCP M190 TYPE A W/BENDS AND BANDS","LF"]
["701.2036","36'' BCCMCP M190 TYPE A W/BENDS AND BANDS","LF"]
["701.2042","42'' BCCMCP M190 TYPE A W/BENDS AND BANDS","LF"]
["701.2048","48'' BCCMCP M190 TYPE A W/BENDS AND BANDS","LF"]
["701.2054","54'' BCCMCP M190 TYPE A W/BENDS AND BANDS","LF"]
["701.2060","60'' BCCMCP M190 TYPE A W/BENDS AND BANDS","LF"]
["701.2066","66'' BCCMCP M190 TYPE A W/BENDS AND BANDS","LF"]
["701.2072","72'' BCCMCP M190 TYPE A W/BENDS AND BANDS","LF"]
["701.2078","78'' BCCMCP M190 TYPE A W/BENDS AND BANDS","LF"]
["701.2084","84'' BCCMCP M190 TYPE A W/BENDS AND BANDS","LF"]
["701.2090","90'' BCCMCP M190 TYPE A W/BENDS AND BANDS","LF"]
["701.2096","96'' BCCMCP M190 TYPE A W/BENDS AND BANDS","LF"]
["701.2112","12'' BCCMCP M190 TYPE B W/BENDS AND BANDS","LF"]
["701.2115","15'' BCCMCP M190 TYPE B W/BENDS AND BANDS","LF"]
["701.2118","18'' BCCMCP M190 TYPE B W/BENDS AND BANDS","LF"]
["701.2121","21'' BCCMCP M190 TYPE B W/BENDS AND BANDS","LF"]
["701.2124","24'' BCCMCP M190 TYPE B W/BENDS AND BANDS","LF"]
["701.2130","30'' BCCMCP M190 TYPE B W/BENDS AND BANDS","LF"]
["701.2136","36'' BCCMCP M190 TYPE B W/BENDS AND BANDS","LF"]
["701.2142","42'' BCCMCP M190 TYPE B W/BENDS AND BANDS","LF"]
["701.2148","48'' BCCMCP M190 TYPE B W/BENDS AND BANDS","LF"]
["701.2154","54'' BCCMCP M190 TYPE B W/BENDS AND BANDS","LF"]
["701.2160","60'' BCCMCP M190 TYPE B W/BENDS AND BANDS","LF"]
["701.2166","66'' BCCMCP M190 TYPE B W/BENDS AND BANDS","LF"]
["701.2172","72'' BCCMCP M190 TYPE B W/BENDS AND BANDS","LF"]
["701.2178","78'' BCCMCP M190 TYPE B W/BENDS AND BANDS","LF"]
["701.2184","84'' BCCMCP M190 TYPE B W/BENDS AND BANDS","LF"]
["701.2190","90'' BCCMCP M190 TYPE B W/BENDS AND BANDS","LF"]
["701.2196","96'' BCCMCP M190 TYPE B W/BENDS AND BANDS","LF"]
["701.2212","12'' BCCMCP M190 TYPE C W/BENDS AND BANDS","LF"]
["701.2215","15'' BCCMCP M190 TYPE C W/BENDS AND BANDS","LF"]
["701.2218","18'' BCCMCP M190 TYPE C W/BENDS AND BANDS","LF"]
["701.2221","21'' BCCMCP M190 TYPE C W/BENDS AND BANDS","LF"]
["701.2224","24'' BCCMCP M190 TYPE C W/BENDS AND BANDS","LF"]
["701.2230","30'' BCCMCP M190 TYPE C W/BENDS AND BANDS","LF"]
["701.2236","36'' BCCMCP M190 TYPE C W/BENDS AND BANDS","LF"]
["701.2242","42'' BCCMCP M190 TYPE C W/BENDS AND BANDS","LF"]
["701.2248","48'' BCCMCP M190 TYPE C W/BENDS AND BANDS","LF"]
["701.2254","54'' BCCMCP M190 TYPE C W/BENDS AND BANDS","LF"]
["701.2260","60'' BCCMCP M190 TYPE C W/BENDS AND BANDS","LF"]
["701.2266","66'' BCCMCP M190 TYPE C W/BENDS AND BANDS","LF"]
["701.2272","72'' BCCMCP M190 TYPE C W/BENDS AND BANDS","LF"]
["701.2278","78'' BCCMCP M190 TYPE C W/BENDS AND BANDS","LF"]
["701.2284","84'' BCCMCP M190 TYPE C W/BENDS AND BANDS","LF"]
["701.2290","90'' BCCMCP M190 TYPE C W/BENDS AND BANDS","LF"]
["701.2296","96'' BCCMCP M190 TYPE C W/BENDS AND BANDS","LF"]
["701.2910","10 INCH CORR ALUMINUN CULVERT PIPE M196 (MINIMUM GAUGE)","LF"]
["701.2912","12 INCH CORR ALUMINUM CULVERT PIPE M196 (MINIMUM GAUGE)","LF"]
["701.2915","15 INCH CORR ALUMINUM CULVERT PIPE M196 (MINIMUM GAUGE)","LF"]
["701.2918","18 INCH CORR ALUMINUM CULVERT PIPE M196 (MINIMUM GAUGE)","LF"]
["701.2921","21 INCH CORR ALUMINUM CULVERT PIPE M196 (MINIMUM GAUGE)","LF"]
["701.2924","24 INCH CORR ALUMINUM CULVERT PIPE M196 (MINIMUM GAUGE)","LF"]
["701.2930","30 INCH CORR ALUMINUM CULVERT PIPE M196 (MINIMUM GAUGE)","LF"]
["701.2933","33 INCH CORR ALUMINUM CULVERT PIPE M196 (MINIMUM GAUGE)","LF"]
["701.2936","36 INCH CORR ALUMINUM CULVERT PIPE M196 (MINIMUM GAUGE)","LF"]
["701.2942","42 INCH CORR ALUMINUM CULVERT PIPE M196 (MINIMUM GAUGE)","LF"]
["701.2948","48 INCH CORR ALUMINUM CULVERT PIPE M196 (MINIMUM GAUGE)","LF"]
["701.2954","54 INCH CORR ALUMINUM CULVERT PIPE M196 (MINIMUM GAUGE)","LF"]
["701.2960","60 INCH CORR ALUMINUM CULVERT PIPE M196 (MINIMUM GAUGE)","LF"]
["701.2966","66 INCH CORR ALUMINUM CULVERT PIPE M196 (MINIMUM GAUGE)","LF"]
["701.2972","72 INCH CORR ALUMINUM CULVERT PIPE M196 (MINIMUM GAUGE)","LF"]
["701.2984","84 INCH CORR ALUMINUM CULVERT PIPE M196 (MINIMUM GAUGE)","LF"]
["701.4312","12 INCH SMOOTH INTERIOR CORRUGATED POLYETHYLENE PIPE","LF"]
["701.4318","18 INCH SMOOTH INTERIOR CORRUGATED POLYETHYLENE PIPE","LF"]
["701.4324","24 INCH SMOOTH INTERIOR CORRUGATED POLYETHYLENE PIPE","LF"]
["701.4330","30 INCH SMOOTH INTERIOR CORRUGATED POLYETHYLENE PIPE","LF"]
["701.4336","36 INCH SMOOTH INTERIOR CORRUGATED POLYETHYLENE PIPE","LF"]
["701.4342","42 INCH SMOOTH INTERIOR CORRUGATED POLYETHYLENE PIPE","LF"]
["701.4348","48 INCH SMOOTH INTERIOR CORRUGATED POLYETHYLENE PIPE","LF"]
["701.4412","12 IN PLASTIC PIPE (WW-P-00380)","LF"]
["701.4415","15 IN PLASTIC PIPE (WW-P-00380)","LF"]
["701.4418","18 IN PLASTIC PIPE (WW-P-00380)","LF"]
["701.4424","24 INCH PLASTIC PIPE (WW-P-00380)","LF"]
["701.5112","12 INCH SMOOTH INTERIOR CORRUGATED POLYPROPYLENE PIPE","LF"]
["701.5118","18 INCH SMOOTH INTERIOR CORRUGATED POLYPROPYLENE PIPE","LF"]
["701.5124","24 INCH SMOOTH INTERIOR CORRUGATED POLYPROPYLENE PIPE","LF"]
["701.5130","30 INCH SMOOTH INTERIOR CORRUGATED POLYPROPYLENE PIPE","LF"]
["701.5136","36 INCH SMOOTH INTERIOR CORRUGATED POLYPROPYLENE PIPE","LF"]
["701.5142","42 INCH SMOOTH INTERIOR CORRUGATED POLYPROPYLENE PIPE","LF"]
["701.5148","48 INCH SMOOTH INTERIOR CORRUGATED POLYPROPYLENE PIPE","LF"]
["701.5203","3 INCH DUCTILE IRON WATER PIPE CLASS 52, RESTRAINED JOINT","LF"]
["701.5204","4 INCH DUCTILE IRON WATER PIPE CLASS 52, RESTRAINED JOINT","LF"]
["701.5206","6 INCH DUCTILE IRON WATER PIPE CLASS 52, RESTRAINED JOINT","LF"]
["701.5208","8 INCH DUCTILE IRON WATER PIPE CLASS 52, RESTRAINED JOINT","LF"]
["701.5210","10 INCH DUCTILE IRON WATER PIPE CLASS 52, RESTRAINED JOINT","LF"]
["701.5212","12 INCH DUCTILE IRON WATER PIPE CLASS 52, RESTRAINED JOINT","LF"]
["701.5214","14 INCH DUCTILE IRON WATER PIPE CLASS 52, RESTRAINED JOINT","LF"]
["701.5216","16 INCH DUCTILE IRON WATER PIPE CLASS 52, RESTRAINED JOINT","LF"]
["701.5218","18 INCH DUCTILE IRON WATER PIPE CLASS 52, RESTRAINED JOINT","LF"]
["701.5220","20 INCH DUCTILE IRON WATER PIPE CLASS 52, RESTRAINED JOINT","LF"]
["701.5224","24 INCH DUCTILE IRON WATER PIPE CLASS 52, RESTRAINED JOINT","LF"]
["701.5230","30 INCH DUCTILE IRON WATER PIPE CLASS 52, RESTRAINED JOINT","LF"]
["701.5236","36 INCH DUCTILE IRON WATER PIPE CLASS 52, RESTRAINED JOINT","LF"]
["701.5242","42 INCH DUCTILE IRON WATER PIPE CLASS 52, RESTRAINED JOINT","LF"]
["701.5248","48 INCH DUCTILE IRON WATER PIPE CLASS 52, RESTRAINED JOINT","LF"]
["701.5303","3 INCH DUCTILE IRON WATER PIPE CLASS 52, PUSH-ON JOINT","LF"]
["701.5304","4 INCH DUCTILE IRON WATER PIPE CLASS 52, PUSH-ON JOINT","LF"]
["701.5306","6 INCH DUCTILE IRON WATER PIPE CLASS 52, PUSH-ON JOINT","LF"]
["701.5308","8 INCH DUCTILE IRON WATER PIPE CLASS 52, PUSH-ON JOINT","LF"]
["701.5310","10 INCH DUCTILE IRON WATER PIPE CLASS 52, PUSH-ON JOINT","LF"]
["701.5312","12 INCH DUCTILE IRON WATER PIPE CLASS 52, PUSH-ON JOINT","LF"]
["701.5314","14 INCH DUCTILE IRON WATER PIPE CLASS 52, PUSH-ON JOINT","LF"]
["701.5316","16 INCH DUCTILE IRON WATER PIPE CLASS 52, PUSH-ON JOINT","LF"]
["701.5318","18 INCH DUCTILE IRON WATER PIPE CLASS 52, PUSH-ON JOINT","LF"]
["701.5320","20 INCH DUCTILE IRON WATER PIPE CLASS 52, PUSH-ON JOINT","LF"]
["701.5324","24 INCH DUCTILE IRON WATER PIPE CLASS 52, PUSH-ON JOINT","LF"]
["701.5330","30 INCH DUCTILE IRON WATER PIPE CLASS 52, PUSH-ON JOINT","LF"]
["701.5336","36 INCH DUCTILE IRON WATER PIPE CLASS 52, PUSH-ON JOINT","LF"]
["701.5342","42 INCH DUCTILE IRON WATER PIPE CLASS 52, PUSH-ON JOINT","LF"]
["701.5348","48 INCH DUCTILE IRON WATER PIPE CLASS 52, PUSH-ON JOINT","LF"]
["701.5403","3 INCH DUCTILE IRON WATER PIPE CLASS 52, MECHANICAL JOINT","LF"]
["701.5404","4 INCH DUCTILE IRON WATER PIPE CLASS 52, MECHANICAL JOINT","LF"]
["701.5406","6 INCH DUCTILE IRON WATER PIPE CLASS 52, MECHANICAL JOINT","LF"]
["701.5408","8 INCH DUCTILE IRON WATER PIPE CLASS 52, MECHANICAL JOINT","LF"]
["701.5410","10 INCH DUCTILE IRON WATER PIPE CLASS 52, MECHANICAL JOINT","LF"]
["701.5412","12 INCH DUCTILE IRON WATER PIPE CLASS 52, MECHANICAL JOINT","LF"]
["701.5414","14 INCH DUCTILE IRON WATER PIPE CLASS 52, MECHANICAL JOINT","LF"]
["701.5416","16 INCH DUCTILE IRON WATER PIPE CLASS 52, MECHANICAL JOINT","LF"]
["701.5418","18 INCH DUCTILE IRON WATER PIPE CLASS 52, MECHANICAL JOINT","LF"]
["701.5420","20 INCH DUCTILE IRON WATER PIPE CLASS 52, MECHANICAL JOINT","LF"]
["701.5424","24 INCH DUCTILE IRON WATER PIPE CLASS 52, MECHANICAL JOINT","LF"]
["701.5603","3 INCH DUCTILE IRON WATER PIPE CLASS 56, RESTRAINED JOINT","LF"]
["701.5604","4 INCH DUCTILE IRON WATER PIPE CLASS 56, RESTRAINED JOINT","LF"]
["701.5606","6 INCH DUCTILE IRON WATER PIPE CLASS 56, RESTRAINED JOINT","LF"]
["701.5608","8 INCH DUCTILE IRON WATER PIPE CLASS 56, RESTRAINED JOINT","LF"]
["701.5610","10 INCH DUCTILE IRON WATER PIPE CLASS 56, RESTRAINED JOINT","LF"]
["701.5612","12 INCH DUCTILE IRON WATER PIPE CLASS 56, RESTRAINED JOINT","LF"]
["701.5614","14 INCH DUCTILE IRON WATER PIPE CLASS 56, RESTRAINED JOINT","LF"]
["701.5616","16 INCH DUCTILE IRON WATER PIPE CLASS 56, RESTRAINED JOINT","LF"]
["701.5618","18 INCH DUCTILE IRON WATER PIPE CLASS 56, RESTRAINED JOINT","LF"]
["701.5620","20 INCH DUCTILE IRON WATER PIPE CLASS 56, RESTRAINED JOINT","LF"]
["701.5624","24 INCH DUCTILE IRON WATER PIPE CLASS 56, RESTRAINED JOINT","LF"]
["701.5630","30 INCH DUCTILE IRON WATER PIPE CLASS 56, RESTRAINED JOINT","LF"]
["701.5636","36 INCH DUCTILE IRON WATER PIPE CLASS 56, RESTRAINED JOINT","LF"]
["701.5642","42 INCH DUCTILE IRON WATER PIPE CLASS 56, RESTRAINED JOINT","LF"]
["701.5648","48 INCH DUCTILE IRON WATER PIPE CLASS 56, RESTRAINED JOINT","LF"]
["701.5703","3 INCH DUCTILE IRON WATER PIPE CLASS 56, PUSH-ON JOINT","LF"]
["701.5704","4 INCH DUCTILE IRON WATER PIPE CLASS 56, PUSH-ON JOINT","LF"]
["701.5706","6 INCH DUCTILE IRON WATER PIPE CLASS 56, PUSH-ON JOINT","LF"]
["701.5708","8 INCH DUCTILE IRON WATER PIPE CLASS 56, PUSH-ON JOINT","LF"]
["701.5710","10 INCH DUCTILE IRON WATER PIPE CLASS 56, PUSH-ON JOINT","LF"]
["701.5712","12 INCH DUCTILE IRON WATER PIPE CLASS 56, PUSH-ON JOINT","LF"]
["701.5714","14 INCH DUCTILE IRON WATER PIPE CLASS 56, PUSH-ON JOINT","LF"]
["701.5716","16 INCH DUCTILE IRON WATER PIPE CLASS 56, PUSH-ON JOINT","LF"]
["701.5718","18 INCH DUCTILE IRON WATER PIPE CLASS 56, PUSH-ON JOINT","LF"]
["701.5720","20 INCH DUCTILE IRON WATER PIPE CLASS 56, PUSH-ON JOINT","LF"]
["701.5724","24 INCH DUCTILE IRON WATER PIPE CLASS 56, PUSH-ON JOINT","LF"]
["701.5730","30 INCH DUCTILE IRON WATER PIPE CLASS 56, PUSH-ON JOINT","LF"]
["701.5736","36 INCH DUCTILE IRON WATER PIPE CLASS 56, PUSH-ON JOINT","LF"]
["701.5742","42 INCH DUCTILE IRON WATER PIPE CLASS 56, PUSH-ON JOINT","LF"]
["701.5748","48 INCH DUCTILE IRON WATER PIPE CLASS 56, PUSH-ON JOINT","LF"]
["701.5803","3 INCH DUCTILE IRON WATER PIPE CLASS 56, MECHANICAL JOINT","LF"]
["701.5804","4 INCH DUCTILE IRON WATER PIPE CLASS 56, MECHANICAL JOINT","LF"]
["701.5806","6 INCH DUCTILE IRON WATER PIPE CLASS 56, MECHANICAL JOINT","LF"]
["701.5808","8 INCH DUCTILE IRON WATER PIPE CLASS 56, MECHANICAL JOINT","LF"]
["701.5810","10 INCH DUCTILE IRON WATER PIPE CLASS 56, MECHANICAL JOINT","LF"]
["701.5812","12 INCH DUCTILE IRON WATER PIPE CLASS 56, MECHANICAL JOINT","LF"]
["701.5814","14 INCH DUCTILE IRON WATER PIPE CLASS 56, MECHANICAL JOINT","LF"]
["701.5816","16 INCH DUCTILE IRON WATER PIPE CLASS 56, MECHANICAL JOINT","LF"]
["701.5818","18 INCH DUCTILE IRON WATER PIPE CLASS 56, MECHANICAL JOINT","LF"]
["701.5820","20 INCH DUCTILE IRON WATER PIPE CLASS 56, MECHANICAL JOINT","LF"]
["701.5824","24 INCH DUCTILE IRON WATER PIPE CLASS 56, MECHANICAL JOINT","LF"]
["701.6006","6 INCH DUCTILE IRON SEWER SAFE PIPE CLASS 52","LF"]
["701.6008","8 INCH DUCTILE IRON SEWER SAFE PIPE CLASS 52","LF"]
["701.6010","10 INCH DUCTILE IRON SEWER SAFE PIPE CLASS 52","LF"]
["701.6012","12 INCH DUCTILE IRON SEWER SAFE PIPE CLASS 52","LF"]
["701.6014","14 INCH DUCTILE IRON SEWER SAFE PIPE CLASS 52","LF"]
["701.6016","16 INCH DUCTILE IRON SEWER SAFE PIPE CLASS 52","LF"]
["701.6018","18 INCH DUCTILE IRON SEWER SAFE PIPE CLASS 52","LF"]
["701.6020","20 INCH DUCTILE IRON SEWER SAFE PIPE CLASS 52","LF"]
["701.6024","24 INCH DUCTILE IRON SEWER SAFE PIPE CLASS 52","LF"]
["701.6030","30 INCH DUCTILE IRON SEWER SAFE PIPE CLASS 52","LF"]
["701.6036","36 INCH DUCTILE IRON SEWER SAFE PIPE CLASS 52","LF"]
["701.6042","42 INCH DUCTILE IRON SEWER SAFE PIPE CLASS 52","LF"]
["701.6048","48 INCH DUCTILE IRON SEWER SAFE PIPE CLASS 52","LF"]
["701.7412","12 INCH BCCMCP M 190 TYPE A END SECTION","EACH"]
["701.7415","15 INCH BCCMCP M 190 TYPE A END SECTION","EACH"]
["701.7418","18 INCH BCCMCP M 190 TYPE A END SECTION","EACH"]
["701.7421","21 INCH BCCMCP M 190 TYPE A END SECTION","EACH"]
["701.7424","24 INCH BCCMCP M 190 TYPE A END SECTION","EACH"]
["701.7430","30 INCH BCCMCP M 190 TYPE A END SECTION","EACH"]
["701.7436","36 INCH BCCMCP M 190 TYPE A END SECTION","EACH"]
["701.7442","42 INCH BCCMCP M 190 TYPE A END SECTION","EACH"]
["701.7448","48 INCH BCCMCP M 190 TYPE A END SECTION","EACH"]
["701.7454","54 INCH BCCMCP M 190 TYPE A END SECTION","EACH"]
["701.7460","60 INCH BCCMCP M 190 TYPE A END SECTION","EACH"]
["701.7466","66 INCH BCCMCP M 190 TYPE A END SECTION","EACH"]
["701.7472","72 INCH BCCMCP M 190 TYPE A END SECTION","EACH"]
["701.7478","78 INCH BCCMCP M 190 TYPE A END SECTION","EACH"]
["701.7484","84 INCH BCCMCP M 190 TYPE A END SECTION","EACH"]
["701.7490","90 INCH BCCMCP M 190 TYPE A END SECTION","EACH"]
["701.7496","96 INCH BCCMCP M 190 TYPE A END SECTION","EACH"]
["701.7512","12 INCH BCCMCP M 190 TYPE A END SECTION ARCH","EACH"]
["701.7515","15 INCH BCCMCP M 190 TYPE A END SECTION ARCH","EACH"]
["701.7518","18 INCH BCCMCP M 190 TYPE A END SECTION ARCH","EACH"]
["701.7521","21 INCH BCCMCP M 190 TYPE A END SECTION ARCH","EACH"]
["701.7524","24 INCH BCCMCP M 190 TYPE A END SECTION ARCH","EACH"]
["701.7530","30 INCH BCCMCP M 190 TYPE A END SECTION ARCH","EACH"]
["701.7536","36 INCH BCCMCP M 190 TYPE A END SECTION ARCH","EACH"]
["701.7542","42 INCH BCCMCP M 190 TYPE A END SECTION ARCH","EACH"]
["701.7548","48 INCH BCCMCP M 190 TYPE A END SECTION ARCH","EACH"]
["701.7554","54 INCH BCCMCP M 190 TYPE A END SECTION ARCH","EACH"]
["701.7560","60 INCH BCCMCP M 190 TYPE A END SECTION ARCH","EACH"]
["701.7566","66 INCH BCCMCP M 190 TYPE A END SECTION ARCH","EACH"]
["701.7572","72 INCH BCCMCP M 190 TYPE A END SECTION ARCH","EACH"]
["701.7578","78 INCH BCCMCP M 190 TYPE A END SECTION ARCH","EACH"]
["701.7584","84 INCH BCCMCP M 190 TYPE A END SECTION ARCH","EACH"]
["701.7590","90 INCH BCCMCP M 190 TYPE A END SECTION ARCH","EACH"]
["701.7596","96 INCH BCCMCP M 190 TYPE A END SECTION ARCH","EACH"]
["701.7612","12 INCH CORRUGATED ALUMINUM CULVERT PIPE END SECTION","EACH"]
["701.7615","15 INCH CORRUGATED ALUMINUM CULVERT PIPE END SECTION","EACH"]
["701.7618","18 INCH CORRUGATED ALUMINUM CULVERT PIPE END SECTION","EACH"]
["701.7621","21 INCH CORRUGATED ALUMINUM CULVERT PIPE END SECTION","EACH"]
["701.7624","24 INCH CORRUGATED ALUMINUM CULBERT PIPE END SECTION","EACH"]
["701.7630","30 INCH CORRUGATED ALUMINUM CULVERT PIPE END SECTION","EACH"]
["701.7633","33 INCH CORRUGATED ALUMINUM CULVERT PIPE END SECTION","EACH"]
["701.7636","36 INCH CORRUGATED ALUMINUM CULVERT PIPE END SECTION","EACH"]
["701.7642","42 INCH CORRUGATED ALUMINUM CULVERT PIPE END SECTION","EACH"]
["701.7648","48 INCH CORRUGATED ALUMINUM CULVERT PIPE END SECTION","EACH"]
["701.7654","54 INCH CORRUGATED ALUMINUM CULVERT PIPE END SECTION","EACH"]
["701.7660","60 INCH CORRUGATED ALUMINUM CULVERT PIPE END SECTION","EACH"]
["701.7666","66 INCH CORRUGATED ALUMINUM CULVERT PIPE END SECTION","EACH"]
["701.7672","72 INCH CORRUGATED ALUMINUM CULVERT PIPE END SECTION","EACH"]
["701.7684","84 INCH CORRUGATED ALUMINUM CULVERT PIPE END SECTION","EACH"]
["701.7712","12 INCH REINFORCED CONCRETE PIPE END SECTION STANDARD 2.3.0","EACH"]
["701.7715","15 INCH REINFORCED CONCRETE PIPE END SECTION STANDARD 2.3.0","EACH"]
["701.7718","18 INCH REINFORCED CONCRETE PIPE END SECTION STANDARD 2.3.0","EACH"]
["701.7721","21 INCH REINFORCED CONCRETE PIPE END SECTION STANDARD 2.3.0","EACH"]
["701.7724","24 INCH REINFORCED CONCRETE PIPE END SECTION STANDARD 2.3.0","EACH"]
["701.7727","27 INCH REINFORCED CONCRETE PIPE END SECTION STANDARD 2.3.0","EACH"]
["701.7730","30 INCH REINFORCED CONCRETE PIPE END SECTION STANDARD 2.3.0","EACH"]
["701.7733","33 INCH REINFORCED CONCRETE PIPE END SECTION STANDARD 2.3.0","EACH"]
["701.7736","36 INCH REINFORCED CONCRETE PIPE END SECTION STANDARD 2.3.0","EACH"]
["701.7742","42 INCH REINFORCED CONCRETE PIPE END SECTION STANDARD 2.3.0","EACH"]
["701.7748","48 INCH REINFORCED CONCRETE PIPE END SECTION STANDARD 2.3.0","EACH"]
["701.8001","PIPE BEDDING CLASS A","CY"]
["701.8002","PIPE BEDDING CLASS B","CY"]
["701.8003","PIPE BEDDING CLASS C","CY"]
["701.8100","FURNISH AND INSTALL DUCTILE IRON FITTINGS","LBS"]
["701.8101","SHUT OFF AND DISCONNECT AT MAIN AND ABANDON SERVICE","EACH"]
["701.8104","4 INCH GATE VALVE AND BOX","EACH"]
["701.8106","6 INCH GATE VALVE AND BOX","EACH"]
["701.8108","8 INCH GATE VALVE AND BOX","EACH"]
["701.8110","10 INCH GATE VALVE AND BOX","EACH"]
["701.8112","12 INCH GATE VALVE AND BOX","EACH"]
["701.8115","15 INCH GATE VALVE AND BOX","EACH"]
["701.8116","16 INCH GATE VALVE AND BOX","EACH"]
["701.8118","18 INCH GATE VALVE AND BOX","EACH"]
["701.8121","21 INCH GATE VALVE AND BOX","EACH"]
["701.8124","24 INCH GATE VALVE AND BOX","EACH"]
["701.8127","27 INCH GATE VALVE AND BOX","EACH"]
["701.8130","30 INCH GATE VALVE AND BOX","EACH"]
["701.8133","33 INCH GATE VALVE AND BOX","EACH"]
["701.8136","36 INCH GATE VALVE AND BOX","EACH"]
["701.8142","42 INCH GATE VALVE AND BOX","EACH"]
["701.8148","48 INCH GATE VALVE AND BOX","EACH"]
["701.8150","TYPE K COPPER SERVICE PIPE","LF"]
["701.8151","CURB STOP BOX","EACH"]
["701.8160","BLOW OFF ASSEMBLY","EACH"]
["701.8161","WATER METER PIT","EACH"]
["701.8162","WATER VALVE MANHOLE (0 - 10') DEEP","EACH"]
["701.8170","8X6 TAPPING SLEEVE & TAPPING VALVE WITH GATE BOX","EACH"]
["701.8200","REMOVE AND RELOCATE WATER PIPE FITTING","LBS"]
["701.8260","REMOVE AND RELOCATE BLOW OFF ASSEMBLY","EACH"]
["701.8261","REMOVE AND RELOCATE WATER METER","EACH"]
["701.9001","CONDUCT LEAKAGE TEST","EACH"]
["701.9002","STERILIZATION OF WATER MAINS","LS"]
["701.9003","REMOVE AND RESET PIPE ALL SIZES","LF"]
["702.0204","4' MANHOLE BLOCK STANDARD 3.2.0","EACH"]
["702.0207","4' MANHOLE BRICK STANDARD 3.2.0","EACH"]
["702.0208","5' MANHOLE BRICK STANDARD 3.2.1","EACH"]
["702.0209","6' MANHOLE BRICK STANDARD 3.2.1","EACH"]
["702.0210","SOLID BLOCK SHALLOW 4'-0\" ROUND MANHOLE STANDARD 3.2.2","EACH"]
["702.0211","SOLID BLOCK SHALLOW 5'-0\" ROUND MANHOLE STANDARD 3.2.2","EACH"]
["702.0304","MANHOLE TYPE P-20 PROVIDENCE STANDARD","EACH"]
["702.0400","SANITARY SEWER MANHOLE","EACH"]
["702.0510","HEAVY-DUTY SQUARE FRAME AND ROUND COVER STANDARD 6.1.1","EACH"]
["702.0511","FRAME AND COVER STANDARD 6.1.0","EACH"]
["702.0512","FRAME AND GRATE STANDARD 6.3.0","EACH"]
["702.0513","FRAME AND GRATE STANDARD 6.3.1","EACH"]
["702.0514","FRAME AND GRATE STANDARD 6.4.0","EACH"]
["702.0515","FRAME AND GRATE HIGH CAPACITY STANDARD 6.3.3","EACH"]
["702.0516","FRAME AND GRATE, HIGH CAPACITY, STANDARD 6.3.4","EACH"]
["702.0517","FRAME AND GRATE, STANDARD 6.3.2","EACH"]
["702.0518","ROUND AREA FRAME AND GRATE STANDARD 6.4.1","EACH"]
["702.0521","FRAME AND COVER STANDARD 6.2.0","EACH"]
["702.0522","FRAME AND COVER STANDARD 6.2.1","EACH"]
["702.0530","PRECAST CONCRETE INLET STONE 5' STANDARD 7.1.5","EACH"]
["702.0531","PRECAST CONCRETE INLET STONE 38'' STANDARD 7.1.6","EACH"]
["702.0532","PRECAST CONCRETE APRON STONE 5' STANDARD 7.1.7","EACH"]
["702.0533","PRECAST CONCRETE APRON STONE 38'' STANDARD 7.1.8","EACH"]
["702.0534","PRECAST CONCRETE INLET STONE SLOPE FACE 5'","EACH"]
["702.0535","PRECAST CONCRETE INLET STONE SLOPE FACE 38''","EACH"]
["702.0540","GRANITE INLET STONE 5 FOOT STANDARD 7.3.5","EACH"]
["702.0541","GRANITE INLET STONE 38'' STANDARD 7.3.6","EACH"]
["702.0542","GRANITE APRON STONE 5FT. STANDARD 7.3.7","EACH"]
["702.0543","GRANITE APRON STONE 38'' STANDARD 7.3.8","EACH"]
["702.0544","GRANITE INLET STONE PROVIDENCE STANDARD P-17","EACH"]
["702.0605","PRECAST CATCH BASIN 4' DIAMETER STANDARD 4.4.0","EACH"]
["702.0610","PRECAST CATCH BASIN 5' DIAMETER STANDARD 4.4.0","EACH"]
["702.0615","PRECAST CATCH BASIN 6' DIAMETER STANDARD 4.4.0","EACH"]
["702.0620","PRECAST CATCH BASIN 4' SQUARE STANDARD 4.3.0","EACH"]
["702.0625","PRECAST CATCH BASIN 6' SQUARE STANDARD 4.3.0","EACH"]
["702.0630","PRECAST MANHOLE 4' DIAMETER STANDARD 4.2.0","EACH"]
["702.0635","PRECAST MANHOLE 5' DIAMETER STANDARD 4.2.1","EACH"]
["702.0640","PRECAST MANHOLE 6' DIAMETER STANDARD 4.2.2","EACH"]
["702.0645","PRECAST MANHOLE 4' SQUARE STANDARD 4.3.0","EACH"]
["702.0650","PRECAST MANHOLE 6' SQUARE STANDARD 4.3.0","EACH"]
["702.0701","CATCH BASIN TYPE 'D' ROUND STANDARD 3.4.0","EACH"]
["702.0702","CATCH BASIN TYPE 'D' SQUARE STANDARD 3.3.0","EACH"]
["702.0703","CATCH BASIN TYPE 'F' ROUND STANDARD 3.4.2","EACH"]
["702.0704","CATCH BASIN TYPE 'F' SQUARE STANDARD 3.3.2","EACH"]
["702.0705","CATCH BASIN W/GUTTER INLET STANDARD 3.4.1","EACH"]
["702.0706","CATCH BASIN TYPE 'R' ROUND STANDARD 3.4.3","EACH"]
["702.0707","FLUSH CATCH BASIN BLOCK STANDARD 3.3.3","EACH"]
["702.0708","CATCH BASIN 5' DIAMETER STANDARD 3.4.5","EACH"]
["702.0709","CATCH BASIN 6' DIAMETER STANDARD 3.4.5","EACH"]
["702.0710","DRIVEWAY BASIN AND GUTTER INLET STANDARD 3.3.1","EACH"]
["702.0711","DROP INLET BRICK STANDARD 3.6.0","EACH"]
["702.0712","PRECAST CONCRETE DROP INLET STANDARD 4.5.0","EACH"]
["702.0713","PRECAST CONCRETE DROP INLET WITH APRON STONE STANDARD 4.5.1","EACH"]
["702.0714","PRECAST CONCRETE DROP INLET WITH APRON STONE STANDARD 4.5.2","EACH"]
["702.0715","PRECAST CONCRETE SUMP ROUND STANDARD 5.1.0","EACH"]
["702.0716","DOUBLE GRATE CATCH BASIN STANDARD 3.3.4","EACH"]
["702.0717","DOUBLE GRATE CATCH BASIN STANDARD 3.3.5","EACH"]
["702.0718","HIGH CAPACITY INLET STANDARD 3.3.6","EACH"]
["702.0719","SOLID BLOCK FLUSH ROUND CATCH BASIN STANDARD 3.4.4","EACH"]
["702.0720","CATCH BASIN P-1 PROVIDENCE STANDARD (0-12')","EACH"]
["702.0721","CATCH BASIN P-1 PROVIDENCE STANDARD (12' & D)","EACH"]
["702.0722","SOLID BLOCK SHALLOW TYPE \"F\" SQUARE CATCH BASIN STANDARD 3.5.0","EACH"]
["702.0723","SOLID BLOCK SHALLOW 5'-0\" SQUARE CATCH BASIN STANDARD 3.5.1","EACH"]
["702.0724","SOLID BLOCK SHALLOW 6'-0\" SQUARE CATCH BASIN STANDARD 3.5.1","EACH"]
["702.0725","SOLID BLOCK SHALLOW DOUBLE GRATE CATCH BASIN STANDARD 3.5.2","EACH"]
["702.0726","SOLID BLOCK SHALLOW DOUBLE GRATE CATCH BASIN STANDARD 3.5.3","EACH"]
["702.0727","SOLID BLOCK SHALLOW DOUBLE GRATE CATCH BASIN STANDARD 3.5.4","EACH"]
["702.0728","SOLID BLOCK SHALLOW DOUBLE GRATE CATCH BASIN STANDARD 3.5.5","EACH"]
["702.0729","PRECAST CONCRETE DROP INLET, LATERAL OUTLET STANDARD 4.5.1","EACH"]
["702.0730","PRECAST CONCRETE DROP INLET, LONGITUDINAL OUTLET STANDARD 4.5.2","EACH"]
["702.0750","MANHOLES, CATCH BASINS & INLETS DEPTHS  GREATER THAN 12' STANDARD 3.7.0","VLF"]
["702.0800","CONCRETE COVER SHALLOW 4'-0\" ROUND MANHOLES STANDARD 4.6.0","EACH"]
["702.0810","CONCRETE COVER SHALLOW 5'-0\" ROUND MANHOLES STANDARD 4.6.1","EACH"]
["702.0820","TOP COVER 4'-0\"  SQUARE CATCH BASINS AND MANHOLES STANDARD 4.7.0","EACH"]
["702.0825","TOP COVER 6'-0\"  SQUARE CATCH BASINS AND MANHOLES STANDARD 4.7.0","EACH"]
["702.0830","TOP COVER MONOLITHIC WITH RISER SECTION 4'-0\"  SQUARE CATCH BASINS AND MANHOLES STANDARD 4.7.1","EACH"]
["702.0835","TOP COVER MONOLITHIC WITH RISER SECTION 6'-0\"  SQUARE CATCH BASINS AND MANHOLES STANDARD 4.7.1","EACH"]
["702.0840","ALTERNATE TOP COVER ROUND PRECAST MANHOLES AND CATCH BASINS STANDARD 4.7.2","EACH"]
["702.0850","CONCRETE COVER SHALLOW TYPE \"F\" SQUARE CATCH BASINS STANDARD 4.8.0","EACH"]
["702.0860","CONCRETE COVER SHALLOW DOUBLE GRATE CATCH BASINS WITH CURB STANDARD 4.8.1","EACH"]
["702.0870","CONCRETE COVER SHALLOW DOUBLE GRATE CATCH BASINS WITHOUT CURB STANDARD 4.8.2","EACH"]
["702.0880","CONCRETE COVER SHALLOW 5'-0\" SQUARE CATCH BASINS STANDARD 4.8.3","EACH"]
["702.0890","CONCRETE COVER SHALLOW 6'-0\" SQUARE CATCH BASINS STANDARD 4.8.4","EACH"]
["702.1500","CONCRETE COLLARS STANDARD 5.4.0","EACH"]
["702.1600","FURNISH AND SET FRAMES, COVERS OR GRATES","EACH"]
["702.1700","REMOVE AND RESET FRAMES COVERS OR GRATES","EACH"]
["703.0008","8'' PERFORATED CONCRETE PIPE M175 WITH FILTER MATERIAL STANDARD 1.1.0","LF"]
["703.0010","10'' PERFORATED CONCRETE PIPE M175 WITH FILTER MATERIAL STANDARD 1.1.0","LF"]
["703.0012","12'' PERFORATED CONCRETE PIPE M175 WITH FILTER MATERIAL STANDARD 1.1.0","LF"]
["703.0015","15'' PERFORATED CONCRETE PIPE M175 WITH FILTER MATERIAL STANDARD 1.1.0","LF"]
["703.0018","18'' PERFORATED CONCRETE PIPE M175 WITH FILTER MATERIAL STANDARD 1.1.0","LF"]
["703.0021","21'' PERFORATED CONCRETE PIPE M175 WITH FILTER MATERIAL STANDARD 1.1.0","LF"]
["703.0024","24'' PERFORATED CONCRETE PIPE M175 WITH FILTER MATERIAL STANDARD 1.1.0","LF"]
["703.0308","8'' CORRUGATED STEEL PIPE UNDERDRAIN M36 W/FILTER MATERIAL STD 1.1.0","LF"]
["703.0310","10'' CORRUGATED STEEL PIPE UNDERDRAIN M36 W/FILTER MATERIAL STD 1.1.0","LF"]
["703.0312","12'' CORRUGATED STEEL PIPE UNDERDRAIN M36 W/FILTER MATERIAL STD 1.1.0","LF"]
["703.0315","15'' CORRUGATED STEEL PIPE UNDERDRAIN M36 W/FILTER MATERIAL STD 1.1.0","LF"]
["703.0318","18'' CORRUGATED STEEL PIPE UNDERDRAIN M36 W/FILTER MATERIAL STD 1.1.0","LF"]
["703.0321","21'' CORRUGATED STEEL PIPE UNDERDRAIN M36 W/FILTER MATERIAL STD 1.1.0","LF"]
["703.0408","8'' BCC UNDERDRAIN M 36 WITH FILTER MATERIAL STANDARD 1.1.0","LF"]
["703.0410","10'' BCC UNDERDRAIN M36 WITH FILTER MATERIAL STANDARD 1.1.0","LF"]
["703.0412","12'' BCC UNDERDRAIN M36 WITH FILTER MATERIAL STANDARD 1.1.0","LF"]
["703.0415","15'' BCC UNDERDRAIN M36 WITH FILTER MATERIAL STANDARD 1.1.0","LF"]
["703.0418","18'' BCC UNDERDRAIN M36 WITH FILTER MATERIAL STANDARD 1.1.0","LF"]
["703.0421","21'' BCC UNDERDRAIN M36 WITH FILTER MATERIAL STANDARD 1.1.0","LF"]
["703.0508","8'' CORRUGATED ALUMINUM PIPE M196 UNDERDRAIN WITH FILTER MATERIAL STD. 1.1.0","LF"]
["703.0510","10'' CORRUGATED ALUMINUM PIPE M196 UNDERDRAIN WITH FILTER MATERIAL STD. 1.1.0","LF"]
["703.0512","12'' CORRUGATED ALUMINUM PIPE M196 UNDERDRAIN WITH FILTER MATERIAL STD. 1.1.0","LF"]
["703.0515","15'' CORRUGATED ALUMINUM PIPE M196 UNDERDRAIN WITH FILTER MATERIAL STD. 1.1.0","LF"]
["703.0518","18'' CORRUGATED ALUMINUM PIPE M196 UNDERDRAIN WITH FILTER MATERIAL STD. 1.1.0","LF"]
["703.0521","21'' CORRUGATED ALUMINUM PIPE M196 UNDERDRAIN WITH FILTER MATERIAL STD. 1.1.0","LF"]
["703.0608","8\" PERFORATED CORRUGATED POLYETHLYNE PIPE M252 UNDERDRAIN WITH FILTER MATERIAL STANDARD 1.1.0","LF"]
["703.0612","12\" PERFORATED CORRUGATED POLYETHLYNE PIPE M252 UNDERDRAIN WITH FILTER MATERIAL STANDARD 1.1.0","LF"]
["703.0708","8\" PERFORATED POLYVINYL CHLORIDE PIPE M278 UNDERDRAIN WITH FILTER MATERIAL STANDARD 1.1.0","LF"]
["703.0712","12\" PERFORATED POLYVINYL CHLORIDE PIPE M278 UNDERDRAIN WITH FILTER MATERIAL STANDARD 1.1.0","LF"]
["703.0812","12\" PERFORATED CORRUGATED POLYETHYLENE PIPE M294 COMBINATION DRAIN WITH FILTER MATERIAL STANDARD 1.2.0","LF"]
["703.0816","16\" PERFORATED CORRUGATED POLYETHYLENE PIPE M294 COMBINATION DRAIN WITH FILTER MATERIAL STANDARD 1.2.0","LF"]
["703.0820","20\" PERFORATED CORRUGATED POLYETHYLENE PIPE M294 COMBINATION DRAIN WITH FILTER MATERIAL STANDARD 1.2.0","LF"]
["703.0824","24\" PERFORATED CORRUGATED POLYETHYLENE PIPE M294 COMBINATION DRAIN WITH FILTER MATERIAL STANDARD 1.2.0","LF"]
["703.0830","30\" PERFORATED CORRUGATED POLYETHYLENE PIPE M294 COMBINATION DRAIN WITH FILTER MATERIAL STANDARD 1.2.0","LF"]
["703.0836","36\" PERFORATED CORRUGATED POLYETHYLENE PIPE M294 COMBINATION DRAIN WITH FILTER MATERIAL STANDARD 1.2.0","LF"]
["703.0842","42\" PERFORATED CORRUGATED POLYETHYLENE PIPE M294 COMBINATION DRAIN WITH FILTER MATERIAL STANDARD 1.2.0","LF"]
["703.0848","48\" PERFORATED CORRUGATED POLYETHYLENE PIPE M294 COMBINATION DRAIN WITH FILTER MATERIAL STANDARD 1.2.0","LF"]
["704.0100","RECONSTRUCT CATCH BASIN/CORBEL CONES","EACH"]
["704.0200","RECONSTRUCT MANHOLE/CORBEL CONES","EACH"]
["704.0300","RECONSTRUCT CATCH BASIN/VERTICAL WALLS","VLF"]
["704.0400","RECONSTRUCT MANHOLE/VERTICAL WALLS","VLF"]
["705.1300","RECONSTRUCT CB TYPE 'D' TO CATCH BASIN WITH GUTTER INLET","EACH"]
["706.9000","PLUG AND CAP PIPE ALL SIZES","EACH"]
["707.0900","ADJUST MANHOLES TO GRADE","EACH"]
["707.0950","ADJUST TELEPHONE MANHOLE TO GRADE","EACH"]
["707.0955","ADJUST ELECTRICAL MANHOLE TO GRADE","EACH"]
["707.1000","ADJUST SANITARY MANHOLE","EACH"]
["707.1010","ADJUST NARRAGANSETT BAY COMMISSION SANITARY MANHOLE","EACH"]
["707.1100","ADJUST CATCH BASINS","EACH"]
["707.1200","ADJUST CATCH BASIN TO MANHOLE","EACH"]
["707.1800","ADJUST CATCH BASIN TO MANHOLE AND FURNISH FRAME AND COVER","EACH"]
["707.1900","ADJUST FRAME & COVER TO GRADE","EACH"]
["707.2000","ADJUST FRAME AND GRATE TO GRADE","EACH"]
["708.9040","CLEANING AND FLUSHING PIPE ALL SIZES","LF"]
["708.9041","CLEANING CATCH BASINS ALL TYPES AND SIZES","EACH"]
["708.9042","CLEANING MANHOLES ALL TYPES AND SIZES","EACH"]
["709.0100","CONCRETE CONNECTING COLLAR STANDARD 1.3.0","CY"]
["709.0200","CONCRETE HEADWALLS FOR PIPE CULVERTS STANDARD 2.1.0","CY"]
["709.0300","CONCRETE HEADWALLS FOR MULTIPLE PIPE CULVERTS STANDARD 2.2.0","CY"]
["709.8103","FURNISH & INSTALL CEMENT CONCRETE CLASS B THRUST & ANCHOR BLOCKS CAST-IN-PLACE","CY"]
["711.0100","PLAIN COBBLE WATERWAY","SY"]
["711.0101","GROUTED COBBLE WATER-WAY","SY"]
["711.0110","3'' PAVED WATERWAY CLASS I-1 STANDARD 8.4.0","SY"]
["711.0111","2'' PAVED WATERWAY CLASS I-1 STANDARD 8.4.0","SY"]
["711.0120","CEMENT CONCRETE WATERWAY","SY"]
["711.0200","BITUMINOUS CONCRETE DITCH STANDARD 8.2.0","SY"]
["711.0300","SEEDED DITCH STANDARD 8.1.0","SY"]
["712.0100","WATER GATE BOX","EACH"]
["712.0200","GAS GATE BOX","EACH"]
["713.8267","REMOVE AND RELOCATE CURB STOP BOX","EACH"]
["713.8268","ADJUST CURB STOP BOX TO GRADE","EACH"]
["713.8269","ADJUST WATER GATE BOXES TO GRADE","EACH"]
["713.8300","ADJUST GAS GATE BOXES TO GRADE","EACH"]
["714.8163","POST TYPE HYDRANT","EACH"]
["714.8164","POST TYPE HYDRANT (HIGH PRESSURE)","EACH"]
["714.8263","REMOVE AND RELOCATE POST TYPE HYDRANT","EACH"]
["714.8264","REMOVE AND RELOCATE POST TYPE HYDRANT HIGH PRESSURE","EACH"]
["714.8265","REMOVE AND SALVAGE POST HYDRANT AND VALVE","EACH"]
["714.8266","REMOVE AND SALVAGE POST TYPE FIRE HYDRANT","EACH"]
["802.0000","TEMPORARY BRIDGE STRUCTURES","LS"]
["802.2000","FENDERS","LS"]
["803.0000","REMOVAL OF EXISTING BRIDGES","LS"]
["803.0100","REMOVE AND DISPOSE EXISTING SUPERSTRUCTURE","LS"]
["803.0200","REMOVE AND DISPOSE EXISTING SUBSTRUCTURE","LS"]
["803.0300","PARTIAL REMOVAL AND DISPOSAL OF EXISTING CONCRETE MASONRY","CY"]
["803.0400","CLEANING BRIDGE BEAM SEATS","EACH"]
["803.0500","TEMPORARY DECK UNDERSIDE AND SIDE PROTECTIVE SHIELDING","SF"]
["804.0100","PREBORING","EACH"]
["804.0210","UNTREATED TIMBER PILES FURNISH AND DRIVE LESS THAN 20 FEET LONG","LF"]
["804.0220","UNTREATED TIMBER PILES FURNISH AND DRIVE 20 TO 30 FEET LONG","LF"]
["804.0230","UNTREATED TIMBER PILES FURNISH AND DRIVE 30 TO 40 FEET LONG","LF"]
["804.0240","UNTREATED TIMBER PILES FURNISH AND DRIVE OVER 40 FEET LONG","LF"]
["804.0410","TREATED TIMBER PILES FURNISH AND DRIVE LESS THAN 20 FEET LONG","LF"]
["804.0420","TREATED TIMBER PILES FURNISH AND DRIVE 20 TO 30 FEET LONG","LF"]
["804.0430","TREATED TIMBER PILES FURNISH AND DRIVE 30 TO 40 FEET LONG","LF"]
["804.0440","TREATED TIMBER PILES FURNISH AND DRIVE OVER 40 FEET LONG","LF"]
["804.0703","PRESTRESSED CONCRETE PILES FURNISHED 45 TONS","LF"]
["804.0704","PRESTRESSED CONCRETE PILES FURNISHED 60 TONS","LF"]
["804.0705","PRESTRESSED CONCRETE PILES FURNISHED 70 TONS","LF"]
["804.0706","PRESTRESSED CONCRETE PILES FURNISHED 100 TONS","LF"]
["804.0707","PRESTRESSED CONCRETE PILES FURNISHED OVER 100 TONS","LF"]
["804.0743","PRESTRESSED CONCRETE PILES DRIVE 45 TONS","LF"]
["804.0744","PRESTRESSED CONCRETE PILES DRIVE 60 TONS","LF"]
["804.0745","PRESTRESSED CONCRETE PILES DRIVE 70 TONS","LF"]
["804.0746","PRESTRESSED CONCRETE PILES DRIVE 100 TONS","LF"]
["804.0747","PRESTRESSED CONCRETE PILES DRIVE OVER 100 TONS","LF"]
["804.0763","PRESTRESSED CONCRETE PILES FURNISH AND DRIVE 45 TONS","LF"]
["804.0764","PRESTRESSED CONCRETE PILES FURNISH AND DRIVE 60 TONS","LF"]
["804.0765","PRESTRESSED CONCRETE PILES FURNISH AND DRIVE 70 TONS","LF"]
["804.0766","PRESTRESSED CONCRETE PILES FURNISH AND DRIVE 100 TONS","LF"]
["804.0767","PRESTRESSED CONCRETE PILES FURNISH AND DRIVE OVER 100 TONS","LF"]
["804.0900","FURNISH & DRIVE CONCRETE FILLED SHELL PILES - 30 TONS","LF"]
["804.0910","FURNISH & DRIVE CONCRETE FILLED SHELL PILES - 45 TONS","LF"]
["804.0920","FURNISH & DRIVE CONCRETE FILLED SHELL PILES - 60 TONS","LF"]
["804.0930","FURNISH & DRIVE CONCRETE FILLED SHELL PILES - 70 TONS","LF"]
["804.0940","FURNISH & DRIVE CONCRETE FILLED SHELL PILES - 100 TONS","LF"]
["804.0950","FURNISH & DRIVE CONCRETE FILLED SHELL PILES - OVER 100 TONS","LF"]
["804.1201","PAINT STEEL H-PILES","LF"]
["804.1202","PAINT STEEL PIPE PILES","LF"]
["804.1210","H PILES FURNISH AND DRIVE 14 INCH 117 LB/FT","LF"]
["804.1220","H PILES FURNISH AND DRIVE 14 INCH 102 LB/FT","LF"]
["804.1230","H PILES FURNISH & DRIVE 14 INCH 89 LB/FT","LF"]
["804.1240","H PILES FURNISH AND DRIVE 14 INCH 73 LB/FT","LF"]
["804.1250","H PILES FURNISH AND DRIVE 12 INCH 74 LB/FT","LF"]
["804.1260","H PILES FURNISH AND DRIVE 12 INCH 53 LB/FT","LF"]
["804.1270","H PILES FURNISH AND DRIVE 10 INCH 57 LB/FT","LF"]
["804.1280","H PILES FURNISH AND DRIVE 10 INCH 42 LB/FT","LF"]
["804.1290","H PILESFURNISH AND DRIVE 8 INCH 36 LB/FT","LF"]
["804.1510","PIPE PILES FURNISH AND DRIVE 10 INCH","LF"]
["804.1520","PIPE PILES FURNISH AND DRIVE 12 INCH","LF"]
["804.1530","PIPE PILES FURNISH AND DRIVE 14 INCH","LF"]
["804.1610","PILE LOAD TEST 30 TON","EACH"]
["804.1620","PILE LOAD TEST 45 TON","EACH"]
["804.1630","PILE LOAD TEST 60 TON","EACH"]
["804.1640","PILE LOAD TEST 70 TON","EACH"]
["804.1710","PILE LOAD TEST 100 TON","EACH"]
["804.1720","PILE LOAD TEST OVER 100 TON","EACH"]
["804.1800","SPECIAL PILE LOAD TEST","EACH"]
["804.2000","MOBILIZATION & DEMOBILIZATION OF PILE DRIVING EQUIPMENT","LS"]
["804.2100","PILE POINTS FOR H PILES 14 INCH X 117 LB/FT","EACH"]
["804.2110","PILE POINTS FOR H PILES 14 INCH X 102 LB/FT","EACH"]
["804.2120","PILE POINTS FOR H PILES 14 INCH X 89 LB/FT","EACH"]
["804.2130","PILE POINTS FOR H PILES 14 INCH X 73 LB/FT","EACH"]
["804.2140","PILE POINTS FOR H PILES 12 INCH X 74 LB/FT","EACH"]
["804.2150","PILE POINTS FOR H PILES 12 INCH X 53 LB/FT","EACH"]
["804.2160","PILE POINTS FOR H PILES 10 INCH X 57 LB/FT","EACH"]
["804.2170","PILE POINTS FOR H PILES 10 INCH X 42 LB/FT","EACH"]
["804.2180","PILE POINTS FOR H PILES 10 INCH X 36 LB/FT","EACH"]
["804.2300","PILE SHOES FOR TIMBER PILES","EACH"]
["805.0100","PERMANENT SHEET PILING STEEL FURNISH AND DRIVE","SF"]
["805.0200","PERMANENT SHEET PILING TIMBER FURNISH AND DRIVE","SF"]
["805.0300","PERMANENT SHEET PILING CONCRETE FURNISH AND DRIVE","SF"]
["805.0400","PERMANENT SHEET PILING - OPTIONAL MATERIAL - FURNISH AND DRIVE","SF"]
["805.2000","TEMPORARY SHEET PILING STEEL FURNISH AND DRIVE","SF"]
["805.2050","TEMPORARY SHEET PILING STEEL ABANDONED IN PLACE","SF"]
["805.2100","TEMPORARY SHEET PILING TIMBER FURNISH AND DRIVE","SF"]
["805.2200","TEMPORARY SHEET PILING CONCRETE FURNISH AND DRIVE","SF"]
["805.2300","TEMPORARY SHEET PILING - OPTIONAL MATERIAL - FURNISH AND DRIVE","SF"]
["805.3000","PRECAST CONCRETE MODULAR WALL","SF"]
["805.3100","PRECAST CONCRETE MODULAR WALL","LF"]
["805.3110","PRECAST CONCRETE MODULAR WALL","LS"]
["805.3200","RETAINED EARTH WALL SYSTEM","SF"]
["805.3210","RETAINED EARTH WALL SYSTEM","LF"]
["805.3250","RETAINED EARTH WALL SYSTEM","LS"]
["805.3500","SOIL NAIL WALL","SF"]
["805.4000","SOLDIER PILES DRIVE, TIMBER","EA"]
["805.4100","SOLDIER PILES DRIVE, STEEL","EA"]
["805.4200","SOLDIER PILES PREDRILLED, TIMBER","EA"]
["805.4300","SOLDIER PILES PREDRILLED, STEEL","EA"]
["805.4400","TIMBER LAGGING - INSTALLED","SF"]
["805.4500","STEEL LAGGING - INSTALLED","SF"]
["805.4600","GROUND ANCHORS INSTALLED","EA"]
["805.4700","WALERS AND BRACING","LF"]
["806.1000","NAIL LAMINATED TIMBER SUPERSTRUCTURE","LS"]
["806.1050","GLUE LAMINATED TIMBER SUPERSTRUCTURE","LS"]
["806.1100","STRESS LAMINATED TIMBER SUPERSTRUCTURE","LS"]
["806.1150","NAIL LAMINATED TIMBER DECKING","MBM"]
["806.1200","GLUE LAMINATED TIMBER DECKING","MBM"]
["806.1250","GLUE LAMINATED TIMBER BEAMS AND STRINGERS","MBM"]
["806.1300","TIMBER BEAMS AND STRINGERS","MBM"]
["806.1350","TIMBER BEAMS AND STRINGERS","BM"]
["806.1400","PLANK TIMBER FOR DECKING","MBM"]
["806.1450","PLANK TIMBER FOR DECKING","BM"]
["806.1500","TIMBER FOR CURBS, RAILS & POSTS","BM"]
["806.1550","TIMBER FOR BEAMSEATS & SILLS","BM"]
["806.1600","TIMBER FOR COLUMNS & SHORING","MBM"]
["806.1650","TIMBER FOR COLUMNS & SHORING","BM"]
["806.1700","TIMBER FOR BRACING","BM"]
["806.1750","HARDWARE FOR TIMBER CONSTRUCTION","LS"]
["807.0110","RANGED CUT STONE MASONRY","CY"]
["807.0111","RANGED CUT FACE MASONRY VENEER","SF"]
["807.0170","RANDOM COURSE D CUT STONE MASONRY","CY"]
["807.0200","SPLIT FACE MASONRY","CY"]
["807.0210","RANGED SPLIT FACE MASONRY","CY"]
["807.0211","RANGED SPLIT FACE MASONRY VENEER","SF"]
["807.0220","RANDOM COURSED SPLIT FACED MASONRY","CY"]
["807.0300","RUBBLE MASONRY","CY"]
["807.0350","POINTING & GROUTING MASONRY","LF"]
["807.0360","POINTING & GROUTING MASONRY UNDERWATER","LF"]
["807.0500","POINTING & GROUTING","LF"]
["808.0120","CONCRETE SUBSTRUCTURE CLASS A 3/4'' TREMIE","CY"]
["808.0320","CONCRETE SUBSTRUCTURE CLASS XX 3/4''","CY"]
["808.0321","CONCRETE SUBSTRUCTURE CLASS HP 3/4'' WALL CAP","CY"]
["808.0322","CONCRETE SUBSTRUCTURE CLASS HP 3/4'' END POSTS","CY"]
["808.0323","CONCRETE SUBSTRUCTURE CLASS HP 3/4'' PARAPETS","CY"]
["808.0324","CONCRETE SUBSTRUCTURE CLASS HP 3/4'' BRIDGE SIDEWALK","CY"]
["808.0501","CONCRETE SUBSTRUCTURE CLASS XX 3/4\" FOOTINGS","CY"]
["808.0502","CONCRETE SUBSTRUCTURE CLASS XX 3/4\" ABUT FOOTING","CY"]
["808.0503","CONCRETE SUBSTRUCTURE CLASS XX 3/4\" PIER FOOTING","CY"]
["808.0504","CONCRETE SUBSTRUCTURE CLASS XX 3/4\" WALL FOOTING","CY"]
["808.0505","CONCRETE SUBSTRUCTURE CLASS HP 3/4'' WALL STEMS","CY"]
["808.0506","CONCRETE SUBSTRUCTURE CLASS HP 3/4'' ABUT STEMS","CY"]
["808.0507","CONCRETE SUBSTRUCTURE CLASS HP 3/4'' PIER STEMS","CY"]
["808.0508","CONCRETE SUBSTRUCTURE CLASS XX 3/4'' APPROACH SLABS","CY"]
["808.0509","CONCRETE SUBSTRUCTURE CLASS HP 3/4'' CULVERTS","CY"]
["808.0511","CONCRETE SUBSTRUCTURE CLASS HP 3/4'' CULVERT FLOOR","CY"]
["808.0512","CONCRETE SUBSTRUCTURE CLASS HP 3/4'' CULVERT WALL","CY"]
["808.0513","CONCRETE SUBSTRUCTURE CLASS HP 3/4'' CULVERT ROOF","CY"]
["808.0514","CONCRETE SUBSTRUCTURE CLASS HP 3/4'' LESS FOOTINGS","CY"]
["808.0601","CONCRETE SUBSTRUCTURE CLASS HP 3/4'' PIERS, COL, CAP","CY"]
["808.0602","CONCRETE SUBSTRUCTURE CLASS HP 3/4'' BACKWALLS","CY"]
["808.0701","REINFORCED CONCRETE STRUCTURE CLASS XX 3/4'' FOOTINGS","CY"]
["808.0702","REINFORCED CONCRETE STRUCTURE CLASS XX 3/4'' SUB-FOOTINGS","CY"]
["808.0703","REINFORCED CONCRETE STRUCTURE CLASS XX 3/4'' GRAVITY WALL","CY"]
["808.0721","UNREINFORCED CONCRETE CLASS A 3/4'' FOOTINGS","CY"]
["808.0722","UNREINFORCED CONCRETE CLASS A 3/4'' SUB-FOOTINGS","CY"]
["808.0723","UNREINFORCED CONCRETE CLASS XX 3/4'' GRAVITY WALLS","CY"]
["808.0724","UNREINFORCED CONCRETE CLASS A 3/4'' CRADLES","CY"]
["808.0730","CONCRETE SUBSTRUCTURE CLASS X 3/4'' MODULAR WALL UNITS","SF"]
["808.0800","CONCRETE RETAINING WALL CLASS HP 3/4\" STANDARD 10.3.0","CY"]
["808.1200","CONCRETE SUPERSTRUCTURE CLASS HP 3/4''","CY"]
["808.1201","CONCRETE SUPERSTRUCTURE CLASS HP 3/4'' RAILS","CY"]
["808.1205","CONCRETE SUPERSTRUCTURE CLASS HP 3/4'' CRT WALLS","CY"]
["808.1501","CONCRETE SUPERSTRUCTURE CLASS HP 3/4'' BRIDGE DECKS","CY"]
["808.1502","CONCRETE SUPERSTRUCTURE CLASS HP 3/4'' BRIDGE SIDEWALKS","CY"]
["808.1503","CONCRETE SUPERSTRUCTURE CLASS HP 3/4'' PARAPETS","CY"]
["808.1506","CONCRETE SUPERSTRUCTURE CLASS HP 3/4'' BARRIERS","CY"]
["808.1507","CONCRETE SUPERSTRUCTURE CLASS HP 3/4'' MEDIANS","CY"]
["808.1508","CONCRETE SUPERSTRUCTURE CLASS HP 3/4'' CULVERTS","CY"]
["808.1509","CONCRETE SUPERSTRUCTURE CLASS HP 3/4'' WALLS","CY"]
["808.1510","CONCRETE SUPERSTRUCTURE CLASS HP 3/4'' BEAMS","CY"]
["808.1601","PREFORMED JOINT FILLER CORK 1/4\"","SF"]
["808.1602","PREFORMED JOINT FILLER CORK 1/2\"","SF"]
["808.1603","PREFORMED JOINT FILLER CORK 3/4\"","SF"]
["808.1604","PREFORMED JOINT FILLER CORK 1\"","SF"]
["808.1605","PREFORMED JOINT FILLER CORK 1-1/4\"","SF"]
["808.1606","PREFORMED JOINT FILLER CORK 1-1/2\"","SF"]
["808.1607","PREFORMED JOINT FILLER CORK 1-3/4\"","SF"]
["808.1608","PREFORMED JOINT FILLER CORK 2\"","SF"]
["808.1611","PREFORMED JOINT FILLER EXPANDED RUBBER 1/4''","SF"]
["808.1612","PREFORMED JOINT FILLER EXPANDED RUBBER 1/2''","SF"]
["808.1613","PREFORMED JOINT FILLER EXPANDED RUBBER 3/4''","SF"]
["808.1614","PREFORMED JOINT FILLER EXPANDED RUBBER 1\"","SF"]
["808.1615","PREFORMED JOINT FILLER EXPANDED RUBBER 1-1/4''","SF"]
["808.1616","PREFORMED JOINT FILLER EXPANDED RUBBER 1-1/2''","SF"]
["808.1617","PREFORMED JOINT FILLER EXPANDED RUBBER 1-3/4''","SF"]
["808.1618","PREFORMED JOINT FILLER EXPANDED RUBBER 2''","SF"]
["808.1621","JOINT SEALER POURED AND CAULKED TYPE A","CI"]
["808.1631","PREFORMED JOINT FILLER BITUMINOUS 1/4''","SF"]
["808.1632","PREFORMED JOINT FILLER BITUMINOUS 1/2\"","SF"]
["808.1633","PREFORMED JOINT FILLER BITUMINOUS 3/4\"","SF"]
["808.1634","PREFORMED JOINT FILLER BITUMINOUS 1\"","SF"]
["808.1635","PREFORMED JOINT FILLER BITUMINOUS 1-1/4''","SF"]
["808.1636","PREFORMED JOINT FILLER BITUMINOUS 1-1/2''","SF"]
["808.1637","PREFORMED JOINT FILLER BITUMINOUS 1-3/4''","SF"]
["808.1640","PREFORMED POLYETHYLENE FOAM JOINT FILLER 1/2''","SF"]
["808.1641","PREFORMED POLYETHYLENE FOAM JOINT FILLER 3/4''","SF"]
["808.1642","PREFORMED POLYETHYLENE FOAM JOINT FILLER 1''","SF"]
["808.1643","PREFORMED POLYETHYLENE FOAM JOINT FILLER 1-1/4''","SF"]
["808.1644","PREFORMED POLYETHYLENE FOAM JOINT FILLER 1-1/2''","SF"]
["808.1645","PREFORMED POLYETHYLENE FOAM JOINT FILLER 1-3/4''","SF"]
["808.1646","PREFORMED POLYETHYLENE FOAM JOINT FILLER 2''","SF"]
["808.1650","MASTIC JOINT SEALER (1'' X 1'')","LF"]
["808.1651","MASTIC JOINT SEALER","CI"]
["808.1660","UNDERPAVEMENT JOINT REPAIRS","LF"]
["808.1670","POLYURETHANE JOINT SEALANT","CI"]
["808.1675","POLYURETHANE ELASTOMERIC JOINT SEALANT","CI"]
["808.1680","PREFORMED NEOPRENE JOINT SEAL- EXPANSION AND FIXED","LF"]
["808.1810","CONCRETE SURFACE FINISHING RUBBED REGULAR","SF"]
["808.1820","CONCRETE SURFACE FINISHING BUSH HAMMERED","SF"]
["808.1830","CONCRETE SURFACE FINISHING SPECIAL FLOAT FINISH","SF"]
["808.1850","CONCRETE SURFACE FINISHING - SANDBLASTED","SF"]
["808.1860","CONCRETE ARCHITECTUAL TREATMENT, FORM LINER FINISH","SF"]
["809.0811","PRESTRESSED CONCRETE BEAM TYPE 1 FURNISH FABRICATE & ERECT CLASS HP 3/4\"","LF"]
["809.0821","PRESTRESSED CONCRETE BEAM TYPE 2 FURNISH FABRICATE & ERECT CLASS HP 3/4\"","LF"]
["809.0831","PRESTRESSED CONCRETE BEAM TYPE 3 FURNISH FABRICATE & ERECT CLASS HP 3/4\"","LF"]
["809.0841","PRESTRESSED CONCRETE BEAM TYPE 4 FURNISH FABRICATE & ERECT CLASS HP 3/4\"","LF"]
["809.0844","PRESTRESSED CONCRETE BEAM TYPE 5 FURNISH FABRICATE & ERECT CLASS HP 3/4\"","LF"]
["809.0845","PRESTRESSED CONCRETE BEAM TYPE 6 FURNISH FABRICATE & ERECT CLASS HP 3/4\"","LF"]
["809.0913","PRESTRESSED CONCRETE BOX BEAM B1-36 FURNISH FABRICATE & ERECT CLASS HP 3/4\"","SF"]
["809.0914","PRESTRESSED CONCRETE BOX BEAM B1-48 FURNISH FABRICATE AND ERECT CLASS HP 3/4\"","SF"]
["809.0923","PRESTRESSED CONCRETE BOX BEAM TYPE B2-36 FURNISH FABRICATE & ERECT CLASS HP 3/4\"","SF"]
["809.0924","PRESTRESSED CONCRETE BOX BEAM TYPE B2-48 FURNISH FABRICATE & ERECT CLASS HP 3/4\"","SF"]
["809.0933","PRESTRESSED CONCRETE BOX BEAM TYPE B3-36 FURNISH FABRICATE & ERECT CLASS HP 3/4\"","SF"]
["809.0934","PRESTRESSED CONCRETE BOX BEAM TYPE B3-48 FURNISH FABRICATE & ERECT CLASS HP 3/4\"","SF"]
["809.0943","PRESTRESSED CONCRETE BOX BEAM TYPE B4-36 FURNISH FABRICATE & ERECT CLASS HP 3/4\"","SF"]
["809.0944","PRESTRESSED CONCRETE BOX BEAM TYPE B4-48 FURNISH FABRICATE & ERECT CLASS HP 3/4\"","SF"]
["809.0945","PRESTRESSED CONCRETE BOX BEAM TYPE B4-36 MOD. FURNISH FAB. & ERECT CLASS HP 3/4\"","SF"]
["809.0946","PRESTRESSED CONCRETE BOX BEAM TYPE B4-48 MOD. FURNISH FAB. & ERECT CLASS HP 3/4\"","SF"]
["809.1010","PRESTRESSED CONCRETE GIRDER, NEW ENGLAND BULB TEE TYPE 1000","LF"]
["809.1012","PRESTRESSED CONCRETE GIRDER, NEW ENGLAND BULB TEE TYPE 1200","LF"]
["809.1014","PRESTRESSED CONCRETE GIRDER, NEW ENGLAND BULB TEE TYPE 1400","LF"]
["809.1016","PRESTRESSED CONCRETE GIRDER, NEW ENGLAND BULB TEE TYPE 1600","LF"]
["809.1018","PRESTRESSED CONCRETE GIRDER, NEW ENGLAND BULB TEE TYPE 1800","LF"]
["809.1041","PRESTRESSED CONCRETE SOLID SLABS 10'' X 36'' FURNISH FAB. & ERECT CLASS HP 3/4\"","SF"]
["809.1042","PRESTRESSED CONCRETE SOLID SLABS 12'' X 36'' FURNISH FAB. & ERECT CLASS HP 3/4\"","SF"]
["809.1043","PRESTRESSED CONCRETE SOLID SLABS 14'' X 36'' FURNISH FAB. & ERECT CLASS HP 3/4\"","SF"]
["809.1044","PRESTRESSED CONCRETE SOLID SLABS 10'' X 48'' FURNISH FAB. & ERECT CLASS HP 3/4\"","SF"]
["809.1045","PRESTRESSED CONCRETE SOLID SLABS 12'' X 48'' FURNISH FAB. & ERECT CLASS HP 3/4\"","SF"]
["809.1046","PRESTRESSED CONCRETE SOLID SLABS 14'' X 48'' FURNISH FAB. & ERECT CLASS HP 3/4\"","SF"]
["809.1141","PRESTRESSED CONCRETE VOIDED SLABS 15 X 36'' FURNISH FAB. & ERECT CLASS HP 3/4\"","SF"]
["809.1142","PRESTRESSED CONCRETE VOIDED SLABS 18 X 36'' FURNISH FAB. & ERECT CLASS HP 3/4\"","SF"]
["809.1143","PRESTRESSED CONCRETE VOIDED SLABS 21 X 36'' FURNISH FAB. & ERECT CLASS HP 3/4\"","SF"]
["809.1144","PRESTRESSED CONCRETE VOIDED SLABS 15 X 48'' FURNISH FAB. & ERECT CLASS HP 3/4\"","SF"]
["809.1145","PRESTRESSED CONCRETE VOIDED SLABS 18'' X 48'' FURNISH FAB. & ERECT CLASS HP 3/4\"","SF"]
["809.1146","PRESTRESSED CONCRETE VOIDED SLABS 21'' X 48'' FURNISH FAB. & ERECT CLASS HP 3/4\"","SF"]
["810.0200","STANDARD BARS GRADE 60","LBS"]
["810.0210","GALVANIZED BAR REINFORCEMENT GRADE 60","LBS"]
["810.0310","GALVANIZED SPIRAL WIRE GRADE 60","LBS"]
["810.0320","SPIRAL WIRE GRADE 60 (PLAIN)","LBS"]
["810.0700","WELDED WIRE FABRIC (PLAIN)","SF"]
["810.0702","WELDED WIRE FABRIC (GALVANIZED)","SF"]
["811.0100","WEEP HOLES 3 INCH DIAMETER","LF"]
["811.0101","WEEP HOLES 4 INCH DIAMETER","LF"]
["811.0200","SUB PAVEMENT DRAINS","EACH"]
["811.1400","THERMOPLASTIC PIPE 2 INCH COMMERCIAL GRADE PLASTIC","LF"]
["811.1401","THERMOPLASTIC PIPE 3 INCH COMMERCIAL GRADE PLASTIC","LF"]
["811.2000","WALL DRAINS 4 INCH DIAMETER W/FILTER STONE","LF"]
["811.2100","WALL DRAINS 6'' BITUMINOUS COATED CORRUGATED METAL PIPE W/FILTER STONE","LF"]
["811.2200","WALL DRAINS 8'' BITUMINOUS COATED CORRUGATED METAL PIPE WITH FILTER STONE","LF"]
["811.2201","WALL DRAINS 8'' BITUMINOUS COATED CORRUGATED METAL PIPE","LF"]
["813.0100","DAMPPROOFING","SY"]
["813.0210","HEAT-APPLIED PREFABRICATED MEMBRANE","SY"]
["813.0310","COLD SPRAY-APPLIED LIQUID MEMBRANE","SY"]
["814.0100","DIAMOND GRINDING OF CONCRETE BRIDGE DECKS","SY"]
["814.0200","TRANSVERSE GROOVING OF CONCRETE BRIDGE DECKS","SY"]
["816.1901","CLASS HP CONCRETE BRIDGE DECK OVERLAYS","CF"]
["816.1920","CLASS HP CONCRETE BRIDGE DECK OVERLAYS","CY"]
["817.2101","REPAIRS TO STRUCTURE CONCRETE MASONRY - PNEUMATICALLY APPLIED MORTAR","SF"]
["817.2102","REPAIRS TO STRUCTURE CONCRETE MASONRY - PNEUMATICALLY APPLIED MORTAR","CF"]
["817.2111","REPAIRS TO STRUCTURE CONCRETE MASONRY - PATCHING MORTAR","SF"]
["817.2112","REPAIRS TO STRUCTURE CONCRETE MASONRY - PATCHING MORTAR","CF"]
["817.2141","REPAIRS TO STRUCTURE CONCRETE MASONRY - FORM AND CAST IN PLACE CONCRETE","SF"]
["817.2142","REPAIRS TO STRUCTURE CONCRETE MASONRY - FORM AND CAST IN PLACE CONCRETE","CF"]
["818.2000","PORTLAND CEMENT CONCRETE DECK REPAIRS","SF"]
["818.2010","PORTLAND CEMENT CONCRETE DECK REPAIRS (FULL DEPTH REMOVAL)","SF"]
["818.2020","PORTLAND CEMENT CONCRETE DECK REPAIRS (PARTIAL DEPTH REMOVAL)","SF"]
["819.0800","DRILL AND GROUT REINFORCING DOWELS","EACH"]
["819.0900","DRILL & SET CONCRETE EXPANSION ANCHORS","EACH"]
["820.0100","CONCRETE SURFACE TREATMENT PROTECTIVE SEALER","SF"]
["820.0200","HIGH PRESSURE WATER CLEANING OF CONCRETE SURFACES","SF"]
["820.0300","HIGH PRESSURE WATER CLEANING OF BRIDGE STRUCTURES","EACH"]
["821.1690","SAW & SEALING JOINTS IN BITUMINOUS CONCRETE PAVEMENT","LF"]
["822.1695","SILICONE HIGHWAY JOINT SEALER","LF"]
["823.1711","COMPRESSION TYPE NEOPRENE EXPANSION JOINT 3\" EXTRUDED SEALER W/HARDWARE","LF"]
["823.1712","COMPRESSION TYPE NEOPRENE EXPANSION JOINT 3\" EXTRUDED SEALER","LF"]
["823.1722","COMPRESSION TYPE NEOPRENE FIXED JOINT 1-5/8\" EXTRUDED SEALER","LF"]
["823.1750","ASPHALTIC EXPANSION JOINT SYSTEM","LF"]
["823.1755","ASPHALTIC EXPANSION JOINT SYSTEM - MATERIALS AND WORKMANSHIP WARRANTY","LF"]
["823.1760","STRIP SEAL EXPANSION JOINT ASSEMBLIES","LF"]
["823.1770","MODULAR EXPANSION JOINT ASSEMBLIES","LF"]
["824.0100","STRUCTURAL STEEL ERECT","LBS"]
["824.0111","AASHTO M270 GRADE 36 STEEL FURNISH, FABRICATE & ERECT","LBS"]
["824.0121","AASHTO M270 GRADE 36 STEEL FURNISH FABRICATE AND ERECT ROLLED SIMPLE SPANS","LBS"]
["824.0122","AASHTO M270 GRADE 36 STEEL FURNISH FABRICATE & ERECT BUILT UP SIMPLE SPANS","LBS"]
["824.0123","AASHTO M270 GRADE 36 STEEL FURNISH FAB. & ERECT ROLLED CONTINUOUS SPANS","LBS"]
["824.0124","AASHTO M270 GRADE 36 STEEL FURNISH FAB. & ERECT BUILT UP CONTINUOUS SPANS","LBS"]
["824.0125","AASHTO M270 GRADE 36 STEEL FURNISH FAB. & ERECT BUILT UP CURVED (SMALL RADIUS)","LBS"]
["824.0126","AASHTO M270 GRADE 36 STEEL FURNISH FAB. & ERECT BUILT UP CURVED (LARGE RADIUS)","LBS"]
["824.0421","AASHTO M270 GRADE 50 STEEL FURNISH FAB. & ERECT ROLLED SIMPLE SPANS","LBS"]
["824.0422","AASHTO M270 GRADE 50 STEEL FURNISH FAB. & ERECT BUILT UP SIMPLE SPANS","LBS"]
["824.0423","AASHTO M270 GRADE 50 STEEL FURNISH FAB. & ERECT ROLLED CONTINUOUS SPANS","LBS"]
["824.0424","AASHTO M270 GRADE 50 STEEL FURNISH FAB. & ERECT BUILT UP CONTINUOUS SPANS","LBS"]
["824.0425","AASHTO M270 GRADE 50 STEEL FURNISH FAB. & ERECT BUILT UP CURVED (SMALL RADIUS)","LBS"]
["824.0426","AASHTO M270 GRADE 50 STEEL FURNISH FAB. & ERECT BUILT UP CURVED (LARGE RADIUS)","LBS"]
["824.0510","AASHTO M270 GRADE 50W STEEL FURNISH FABRICATE AND ERECT","LBS"]
["824.0511","AASHTO M270 GRADE 50W STEEL FURNISH FAB. & ERECT ROLLED SIMPLE SPANS","LBS"]
["824.0512","AASHTO M270 GRADE 50W STEEL FURNISH FAB. & ERECT BUILT UP SIMPLE SPANS","LBS"]
["824.0513","AASHTO M270 GRADE 50W STEEL FURNISH FAB. & ERECT ROLLED CONTINUOUS SPANS","LBS"]
["824.0514","AASHTO M270 GRADE 50W STEEL FURNISH FAB. & ERECT BUILT UP CONTINUOUS SPANS","LBS"]
["824.0515","AASHTO M270 GRADE 50W STEEL FURNISH FAB. & ERECT BUILT UP CURVED (SMALL RADIUS)","LBS"]
["824.0516","AASHTO M270 GRADE 50W STEEL FURNISH FAB. & ERECT BUILT UP CURVED (LARGE RADIUS)","LBS"]
["824.0610","WELDED STUD SHEAR CONNECTORS 7/8 INCH DIAMETER","EACH"]
["824.0620","WELDED STUD SHEAR CONNECTORS 3/4 INCH DIAMETER","EACH"]
["824.0710","STAINLESS STEEL FURNISH FABRICATE AND ERECT","LBS"]
["824.8010","ANCHORAGE ASSEMBLIES FOR FUTURE FIXTURES","EACH"]
["825.8015","SURFACE PREPARATION USING SSPC-SP1 METHODS","SF"]
["825.8016","SURFACE PREPARATION USING SSPC-SP1 METHODS","LS"]
["825.8020","SURFACE PREPARATION USING SSPC-SP2,SSPC- SP3, AND/OR SSPC-SP11 METHODS","SF"]
["825.8021","SURFACE PREPARATION USING SSPC-SP2,SSPC- SP3, AND/OR SSPC-SP11 METHODS","LS"]
["825.8025","SURFACE PREPARATION TO SSPC-SP6 STANDARDS","SF"]
["825.8026","SURFACE PREPARATION TO SSPC-SP6 STANDARDS","LS"]
["825.8030","SURFACE PREPARATION USING SSPC-SP7 METHODS","SF"]
["825.8031","SURFACE PREPARATION USING SSPC-SP7 METHODS","LS"]
["825.8035","SURFACE PREPARATION USING HIGH PRESSURE WATER JETTING","SF"]
["825.8036","SURFACE PREPARATION USING HIGH PRESSURE WATER JETTING","LS"]
["825.8040","PAINTING EXISTING STRUCTURAL STEEL","SF"]
["825.8041","PAINTING EXISTING STRUCTURAL STEEL","LS"]
["825.8045","PAINTING STRUCTURAL STEEL","SF"]
["825.8046","PAINTING STRUCTURAL STEEL","LS"]
["826.0100","CONTAINMENT, COLLECTION, STORAGE AND DISPOSAL OF DEBRIS AND SPENT MATERIALS","LS"]
["826.0200","PERSONNEL PROTECTION DURING PAINTING AND CLEANING OPERATIONS","LS"]
["827.8038","THERMAL SPRAYED ZINC COATING STRUCTURAL STEEL","SF"]
["828.0100","POT BEARINGS","EACH"]
["828.0102","PIN CONNECTED BEARING PEDESTAL BEARINGS","EACH"]
["828.0200","SLIDING BEARINGS","EACH"]
["828.0210","SLIDING BEARINGS STANDARD EXPANSION","EACH"]
["828.0220","SLIDING BEARINGS FIXED COMPANION","EACH"]
["828.0301","ELASTOMERIC BEARINGS PLAIN","EACH"]
["828.0303","ELASTOMERIC BEARINGS LAMINATED","EACH"]
["828.0304","ELASTOMERIC BEARINGS STRIP PLAIN","SF"]
["828.0400","PEDESTRIAN BRIDGE BEARINGS","EACH"]
["828.0500","BASE ISOLATION BEARINGS","EACH"]
["829.0300","POLYVINYL CHLORIDE SCUPPER PIPING","LF"]
["830.0110","ALUMINUM BRIDGE RAIL 1 BAR ORNAMENTAL","LF"]
["830.0111","ALUMINUM BRIDGE RAIL 1 BAR STRUCTURAL","LF"]
["830.0200","ALUMINUM BRIDGE RAIL REMOVE AND RESET","LF"]
["830.0210","STEEL BRIDGE RAIL 1 BAR STRUCTURAL","LF"]
["830.0220","STEEL BRIDGE RAIL 2 BAR CRASH TESTED","LF"]
["830.0230","STEEL BRIDGE RAIL 3 BAR TRAFFIC TYPICAL","LF"]
["830.0240","STEEL BRIDGE RAIL 4 BAR COMBINATION","LF"]
["830.0250","BALDWIN 4 BAR ORNAMENTAL RAIL","LF"]
["830.0300","STEEL BRIDGE RAIL MEDIAN BEAM TYPE","LF"]
["830.0301","ANCHOR ASSEMBLIES FOR FUTURE RAIL","EACH"]
["830.0400","STEEL BRIDGE RAIL REMOVE AND RESET","LF"]
["831.0110","PEDESTRIAN CHAIN LINK FENCE","LF"]
["831.0111","SPECIAL PEDESTRIAN CHAIN LINK FENCE","LF"]
["831.0120","PEDESTRIAN CHAIN LINK FENCE-ALUMINUM","LF"]
["831.0130","RAILROAD PROTECTIVE BARRIER RAILING","LF"]
["832.8050","BRIDGE MINIMUM CLEARANCE SIGNS","EACH"]
["832.8051","BRIDGE IDENTIFICATION SIGNS","EACH"]
["833.0400","GRANITE IDENTIFICATION TABLETS","EACH"]
["834.0111","VERTICAL FACE GRANITE CURB STRAIGHT 10'' REVEAL","LF"]
["834.0112","VERTICAL FACE GRANITE CURB CURVED 10'' REVEAL","LF"]
["834.0121","VERTICAL FACE GRANITE CURB STRAIGHT 9'' REVEAL","LF"]
["834.0122","VERTICAL FACE GRANITE CURB CURVED 9'' REVEAL","LF"]
["834.0123","VERTICAL FACE GRANITE CURB TRANSITION","LF"]
["834.0131","VERTICAL FACE GRANITE CURB STRAIGHT 7'' REVEAL","LF"]
["834.0132","VERTICAL FACE GRANITE CURB CURVED 7'' REVEAL","LF"]
["834.0210","SLOPE FACE GRANITE CURB STRAIGHT 10'' X 9''","LF"]
["834.0211","SLOPE FACE GRANITE CURB STRAIGHT 10'' X 16''","LF"]
["834.0212","SLOPE FACE GRANITE CURB STRAIGHT 10'' X 15''","LF"]
["834.0213","SLOPE FACE GRANITE CURB STRAIGHT 10” X 12”","LF"]
["834.0214","SLOPE FACE GRANITE CURB STRAIGHT 7'' X 18''","LF"]
["834.0220","SLOPE FACE GRANITE CURB CURVED 10'' X 9''","LF"]
["834.0221","SLOPE FACE GRANITE CURB CURVED 10'' X 16''","LF"]
["834.0222","SLOPE FACE GRANITE CURB STRAIGHT TRANSITION","LF"]
["834.0223","SLOPE FACE GRANITE CURB CURVED 10'' X 15''","LF"]
["835.0110","DECK SCUPPERS SINGLE","EACH"]
["835.0120","DECK SCUPPERS DOUBLE","EACH"]
["835.0130","DECK SCUPPERS TRIPLE","EACH"]
["835.0210","DECK SCUPPERS SINGLE COMPLETE WITH DOWNSPOUT","EACH"]
["835.0220","DECK SCUPPERS DOUBLE COMPLETE WITH DOWNSPOUT","EACH"]
["835.0230","DECK SCUPPERS TRIPLE COMPLETE WITH DOWNSPOUT","EACH"]
["835.0301","DECK SCUPPER CONNECTION AND DOWNSPOUT STEEL","LF"]
["835.0302","DECK SCUPPER CONNECTION AND DOWNSPOUT CAST IRON","LF"]
["836.0100","STRUCTURAL CONCRETE CRACK REPAIR BY EPOXY-RESIN BASE ADHESIVE INJECTION","LF"]
["837.0100","REPAIRS TO STRUCTURAL CONCRETE MASONRY WITH INTEGRALLY COLORED CONCRETE OR PATCHING MORTAR","CF"]
["838.0100","SAW CUT IN EXISTING CONCRETE WALL","LF"]
["839.0100","PARTIAL-DEPTH REMOVAL AND DISPOSAL OF BITUMINOUS PAVEMENT FROM CONCRETE BRIDGE DECKS","SY"]
["839.0200","FULL DEPTH REMOVAL AND DISPOSAL OF BITUMINOUS PAVEMENT FROM CONCRETE BRIDGE DECKS","SY"]
["840.0100","DECK SURFACE CONCRETE REMOVAL BY HYDRODEMOLITION","SF"]
["841.0100","PRE AND POST CONSTRUCTION CONDITION SURVEYS","LS"]
["842.0100","ANTI-GRAFFITI COATING","SF"]
["901.0101","GUARDRAIL STEEL BEAM SINGLE FACE EARTH AND ASPHALT","LF"]
["901.0102","GUARDRAIL STEEL BEAM SINGLE FACE WITH RUBRAIL EARTH AND ASPHALT","LF"]
["901.0103","GUARDRAIL STEEL BEAM SINGLE FACE CONCRETE","LF"]
["901.0104","GUARDRAIL STEEL BEAM SINGLE FACE WITH RUBRAIL CONCRETE","LF"]
["901.0111","GUARDRAIL STEEL BEAM DOUBLE FACE EARTH AND ASPHALT","LF"]
["901.0112","GUARDRAIL STEEL BEAM DOUBLE FACE WITH RUBRAIL EARTH AND ASPHALT","LF"]
["901.0113","GUARDRAIL STEEL BEAM DOUBLE FACE","LF"]
["901.0114","GUARDRAIL STEEL BEAM DOUBLE FACE WITH RUBRAIL CONCRETE","LF"]
["901.0121","GUARDRAIL STEEL BEAM DOUBLE HEIGHT SINGLE FACE EARTH AND ASPHALT","LF"]
["901.0122","GUARDRAIL STEEL BEAM DOUBLE HEIGHT SINGLE FACE W/RUBRAIL EARTH & ASPHALT","LF"]
["901.0123","GUARDRAIL STEEL BEAM DOUBLE HEIGHT SINGLE FACE CONCRETE","LF"]
["901.0124","GUARDRAIL STEEL BEAM DOUBLE HEIGHT SINGLE FACE WITH RUBRAIL CONCRETE","LF"]
["901.0131","GUARDRAIL STEEL BEAM SINGLE FACE WITH LIGHT BARRIER EARTH AND ASPHALT","LF"]
["901.0132","GUARDRAIL STEEL BEAM SINGLE FACE WITH RUBRAIL W/LIGHT BARRIER EARTH & ASPHALT","LF"]
["901.0133","GUARDRAIL STEEL BEAM SINGLE FACE WITH RUBRAIL W/LIGHT BARRIER CONCRETE","LF"]
["901.0134","GUARDRAIL STEEL BEAM SINGLE FACE WITH LIGHT BARRIER CONCRETE","LF"]
["901.0141","GUARDRAIL STEEL BEAM DOUBLE FACE WITH LIGHT BARRIER EARTH AND ASPHALT","LF"]
["901.0142","GUARDRAIL STEEL BEAM DOUBLE FACE WITH RUBRAIL W/LIGHT BARRIER EARTH & ASPHALT","LF"]
["901.0143","GUARDRAIL STEEL BEAM DOUBLE FACE WITH LIGHT BARRIER CONCRETE","LF"]
["901.0144","GUARDRAIL STEEL BEAM DOUBLE FACE WITH RUBRAIL WITH LIGHT BARRIER CONCRETE","LF"]
["901.0151","TERMINAL END SECTION SINGLE FACE STANDARD 34.3.2","EACH"]
["901.0152","TAPERED ANCHOR SECTION SINGLE FACE EARTH AND ASPHALT","EACH"]
["901.0153","TAPERED ANCHOR SECTION DOUBLE FACE EARTH AND ASPHALT","EACH"]
["901.0154","BARRIER END SECTION DOUBLE FACE EARTH AND ASPHALT","EACH"]
["901.0155","DOUBLE HEIGHT TERMINAL END SECTION","EACH"]
["901.0156","TAPERED ANCHOR SECTION SINGLE FACE CONCRETE","EACH"]
["901.0157","TAPERED ANCHOR SECTION DOUBLE FACE CONCRETE","EACH"]
["901.0158","BARRIER END SECTION DOUBLE FACE CONCRETE","EACH"]
["901.0159","FLARED END SECTION","EACH"]
["901.0160","REFLECTORIZED TRIANGULAR DELINEATORS STANDARD 34.2.5","EACH"]
["901.0161","GUARDRAIL STEEL BEAM POST (IN EARTH AND ASPHALT)","EACH"]
["901.0162","GUARDRAIL STEEL BEAM POST (IN CONCRETE)","EACH"]
["901.0163","GUARDRAIL STEEL BEAM POST IN LEDGE STANDARD 34.1.2","EACH"]
["901.0164","STEEL BEAM OFFSET BRACKET","EACH"]
["901.0165","STEEL BEAM GUARDRAIL SECTION (12.5 FT. BY 12.0 INCHES)","EACH"]
["901.0166","STEEL BEAM RUB RAIL 6 X 12 SECTION","EACH"]
["901.0167","STEEL BEAM END POST AP-2","EACH"]
["901.0168","STEEL BEAM BRACKET AP-2","EACH"]
["901.0169","STEEL BEAM BRACKET AP-2 STEEL BEAM POST","EACH"]
["901.0170","STEEL BEAM BRACKET AP-3","EACH"]
["901.0171","STEEL BEAM RAIL FROM ANCHOR TO AP-3 25'","EACH"]
["901.0172","STEEL BEAM ANCHOR CLASS B CONCRETE","EACH"]
["901.0175","STEEL THRIE BEAM GUARDRAIL SINGLE FACE STANDARD 34.5.3","LF"]
["901.0176","STEEL THRIE BEAM GUARDRAIL DOUBLE FACE STANDARD 34.5.4","LF"]
["901.0177","STEEL THRIE BEAM GUARDRAIL TRANSITION","EACH"]
["901.0178","STEEL THRIE BEAM GUARDRAIL TERMINAL END SECTION","EACH"]
["901.0182","GUARDRAIL STEEL BEAM TREATMENT AT BRIDGE ABUTMENT","EACH"]
["901.0185","STEEL THRIE BEAM BRIDGE CONNECTION","EACH"]
["901.0190","GUARDRAIL STEEL BEAM ANCHORAGE APPROACH SECTION STANDARDS 34.3.1 AND 34.3.3","EACH"]
["901.0191","GUARDRAIL STEEL BEAM ANCHORAGE TRAILING END SECTION STANDARD 34.3.4","EACH"]
["901.0193","GUARDRAIL STEEL BEAM SINGLE FACE STANDARD 34.2.0","LF"]
["901.0194","GUARDRAIL CONNECTION TO BARRIER - APPROACH END SECTION - STD. 34.3.7","EACH"]
["901.0195","GUARDRAIL CONNECTION TO BARRIER - TRAILING END SECTION - STD. 34.3.8","EACH"]
["901.0196","GUARDRAIL CONNECTION TO EXISTING ENDPOST TRAILING END SECTION, STANDARD 34.3.6","EACH"]
["901.0197","GUARDRAIL CONNECTION TO EXISTING ENDPOST APPROACH END SECTION, STANDARD 34.3.5","EACH"]
["901.0198","GUARDRAIL END TREATMENT, NON-ENERGY ABSORBING TERMINAL","EACH"]
["901.0199","GUARDRAIL END TREATMENT, ENERGY ABSORBING TERMINAL","EACH"]
["901.0400","RUSTIC GUARDRAIL","LF"]
["901.0430","EARTH BERM FOR ROADSIDE BARRIER, TERMINAL SECTIONS, STANDARD 34.3.0","EACH"]
["901.0901","REMOVE AND RESET GUARDRAIL ALL TYPES","LF"]
["901.0902","REMOVE AND RESET TERMINAL END SECTION","EACH"]
["902.0100","STEEL BACKED TIMBER GUARDRAIL STANDARD 34.4.0","LF"]
["902.0200","STEEL BACKED TIMBER GUARDRAIL TERMINAL SECTION TYPE 1 STANDARD 34.4.1","EACH"]
["902.0210","STEEL BACKED TIMBER GUARDRAIL TERMINAL SECTION TYPE 2 STANDARD 34.4.2","EACH"]
["903.0110","WOVEN WIRE RIGHT-OF-WAY FENCE STANDARD 31.3.0","LF"]
["903.0203","CHAIN LINK FENCE 3' STANDARD 31.1.0","LF"]
["903.0204","CHAIN LINK FENCE 4' STANDARD 31.1.0","LF"]
["903.0205","CHAIN LINK FENCE 5' STD 31.2.0","LF"]
["903.0206","CHAIN LINK FENCE 6' STD 31.2.0","LF"]
["903.0207","CHAIN LINK FENCE 5' INTERMEDIATE POST STANDARD 31.2.1","LF"]
["903.0208","CHAIN LINK FENCE 6' INTERMEDIATE POST STANDARD 31.2.1","LF"]
["903.0209","POST HOLES IN LEDGE","EACH"]
["903.0224","GATE, CHAIN LINK 3' STANDARD 31.1.0","EACH"]
["903.0225","GATE, CHAIN LINK 4' STANDARD 31.1.0","EACH"]
["903.0226","GATE, CHAIN LINK 5' STANDARD 31.2.0","EACH"]
["903.0227","GATE, CHAIN LINK 6' STANDARD 31.2.0","EACH"]
["903.0228","DOUBLE GATE, CHAIN LINK 3’ STANDARD 31.1.0","EACH"]
["903.0229","DOUBLE GATE, CHAIN LINK 4' STANDARD 31.1.0","EACH"]
["903.0230","DOUBLE GATE, CHAIN LINK 5' STANDARD 31.2.0","EACH"]
["903.0231","DOUBLE GATE, CHAIN LINK 6' STANDARD 31.2.0","EACH"]
["903.0240","WOODEN FENCE, CEDAR POLE GROUND MOUNTED 8 FOOT","LF"]
["903.0241","WOODEN FENCE, CEDAR POLE WALL MOUNTED 8 FOOT","LF"]
["903.0250","SPLIT RAIL FENCE","LF"]
["903.0251","SPLIT RAIL GATE","EACH"]
["903.0323","POST WITH PLATE AND BOLT ON BRIDGE CHAIN LINK","EACH"]
["903.0410","TEMPORARY CHAIN LINK FENCE","LF"]
["903.0411","TEMPORARY CHAIN LINK GATE","EACH"]
["904.0100","REMOVE AND RESET FENCE AND/OR RAILING","LF"]
["904.0101","REMOVE AND RESET FENCE AND/OR RAILING CHAIN LINK","LF"]
["904.0102","REMOVE AND RESET FENCE AND/OR RAILING WOOD STOCKADE","LF"]
["904.0103","REMOVE AND RESET FENCE AND/OR RAILING WOOD BOARD","LF"]
["904.0104","REMOVE AND RESET FENCE AND/OR RAILING WOOD PICKET","LF"]
["904.0105","REMOVE AND RESET FENCE AND/OR RAILING WOOD RAIL","LF"]
["904.0120","REMOVE AND RESET FENCE AND/OR RAILING WIRE FENCE","LF"]
["904.0130","REMOVE AND RESET FENCE AND/OR RAILING STEEL PIPE RAIL WITH CONCRETE POST","LF"]
["904.0200","FENCE POSTS REPLACED","EACH"]
["905.0110","PORTLAND CEMENT SIDEWALK MONOLITHIC STANDARD 43.1.0","CY"]
["905.0115","PORTLAND CEMENT CONCRETE DRIVEWAY STANDARD 43.5.0","CY"]
["905.0130","PORTLAND CEMENT CONCRETE MEDIAN 4'' MONOLITHIC","CY"]
["905.0131","PORTLAND CEMENT CONCRETE MEDIAN 6'' MONOLITHIC","CY"]
["905.0140","BITUMINOUS SIDEWALK STANDARD 43.2.0","TON"]
["906.0100","SLOPE FACED GRANITE CURB - QUARRY SPLIT STRAIGHT STANDARD 7.4.0","LF"]
["906.0101","SLOPE FACED GRANITE CURB - QUARRY SPLIT CIRCULAR STANDARD 7.4.0","LF"]
["906.0102","SLOPE FACED GRANITE TRANSITION CURB STANDARD 7.4.1","EACH"]
["906.0103","GRANITE TRANSITION CURB VERTICAL FACE TO SLOPED FACE STANDARD 7.4.2","EACH"]
["906.0110","GRANITE CURB, QUARRY SPLIT STRAIGHT, STANDARD 7.3.0","LF"]
["906.0111","GRANITE CURB, QUARRY SPLIT CIRCULAR, STANDARD 7.3.0","LF"]
["906.0112","GRANITE CURB PROVIDENCE STANDARD 7\" STRAIGHT","LF"]
["906.0113","GRANITE CURB PROVIDENCE STANDARD 7\" CIRCULAR","LF"]
["906.0116","GRANITE CURB, QUARRY SPLIT 2 FOOT CORNERS, STANDARD 7.3.4","EACH"]
["906.0117","GRANITE CURB - QUARRY SPLIT 3 FOOT CORNERS","EACH"]
["906.0118","6' GRANITE TRANSITION CURB, QUARRY SPLIT SPECIAL TRANSITION STANDARD 7.3.2","EACH"]
["906.0119","3' GRANITE TRANSITION CURB STANDARD 7.3.1","EACH"]
["906.0120","GRANITE WHEELCHAIR RAMP CURB STANDARDS 7.3.3, 43.3.0 AND 43.3.1","EACH"]
["906.0130","GRANITE RAMP STONE STRAIGHT STANDARD 7.3.9","EACH"]
["906.0131","GRANITE RAMP STONE CIRCULAR STANDARD 7.3.9","EACH"]
["906.0140","GRANITE TRUCK APRON STONE STANDARD 7.7.0","EACH"]
["906.0210","CEMENT CONCRETE CURB PRECAST STRAIGHT STANDARD 7.1.0","LF"]
["906.0211","CEMENT CONCRETE CURB PRECAST CIRCULAR STANDARD 7.1.0","LF"]
["906.0212","CEMENT CONCRETE CURB PRECAST 2' CORNER STANDARD 7.1.4","EACH"]
["906.0220","CEMENT CONCRETE CURB PRECAST 3' CORNER","EACH"]
["906.0221","6' PRECAST CONCRETE TRANSITION CURB STANDARD 7.1.2","EACH"]
["906.0230","CEMENT CONCRETE SLOPE FACE CURB PRECAST STRAIGHT STANDARD 7.2.0","LF"]
["906.0231","CEMENT CONCRETE SLOPE FACE CURB PRECAST CIRCULAR STANDARD 7.2.0","LF"]
["906.0240","CEMENT CONCRETE CURB TYPES 10'' X 10'' STRAIGHT","LF"]
["906.0241","CEMENT CONCRETE CURB TYPES 10'' X 10'' CIRCULAR","LF"]
["906.0242","CEMENT CONCRETE EDGING PRECAST STRAIGHT","LF"]
["906.0243","CEMENT CONCRETE EDGING PRECAST 2 FOOT CORNER","EACH"]
["906.0244","CEMENT CONCRETE EDGING PRECAST 3 FOOT CORNER","EACH"]
["906.0245","PRECAST CAR STOPS, STD. 7.2.4","EACH"]
["906.0250","PRECAST CONCRETE WHEELCHAIR RAMP CURB STANDARDS 7.1.3, 43.3.0  AND 43.3.1","EACH"]
["906.0260","PRECAST CONCRETE RAMP STONE 12-INCH STRAIGHT STANDARD 7.1.9","EACH"]
["906.0261","PRECAST CONCRETE RAMP STONE 12-INCH CIRCULAR STANDARD 7.1.9","EACH"]
["906.0262","PRECAST CONCRETE RAMP STONE 18-INCH STRAIGHT STANDARD 7.1.9","EACH"]
["906.0263","PRECAST CONCRETE RAMP STONE 18-INCH CIRCULAR STANDARD 7.1.9","EACH"]
["906.0270","PRECAST CONCRETE TRANSITION CURB STANDARD 7.2.2","EACH"]
["906.0271","PRECAST CONCRETE SLOPE FACE TRANSITION CURB STANDARD 7.2.1","EACH"]
["906.0280","3' PRECAST CONCRETE TRANSITION CURB STANDARD 7.1.1","EACH"]
["906.0561","CEMENT CONCRETE EDGING 18 INCH LOT CURB STANDARD 7.2.3","LF"]
["906.0562","CEMENT CONCRETE EDGING 24 INCH LOT CURB STANDARD 7.2.3","LF"]
["906.0563","CEMENT CONCRETE EDGING 30 INCH LOT CURB","LF"]
["906.0564","CEMENT CONCRETE EDGING 36 INCH LOT CURB","LF"]
["906.0565","CEMENT CONCRETE EDGING 42 INCH LOT CURB","LF"]
["906.0600","BITUMINOUS CURBING STANDARD 7.5.0","LF"]
["906.0602","BITUMINOUS BERM STANDARD 7.5.1","LF"]
["906.0700","REMOVE, HANDLE, HAUL TRIM RESET CURB EDGING, STRAIGHT, CIRCULAR ALL TYPES","LF"]
["906.0720","RESET STOCKPILE CURB STRAIGHT CIRCULAR CORNER RETURNS","LF"]
["907.0100","WATER FOR DUST CONTROL","MGAL"]
["907.0101","WATER FOR RECYCLING","MGAL"]
["907.0102","WATER FOR COMPACTION CONTROL","MGAL"]
["907.0200","CALCIUM CHLORIDE FOR DUST CONTROL (PROJECT WIDE)","TON"]
["907.0201","CALCIUM CHLORIDE FOR RECYCLING","TON"]
["907.0202","CALCIUM CHLORIDE FOR PAVEMENT REHABILITATION","TON"]
["907.0300","BITUMEN FOR DUST CONTROL","TON"]
["908.0100","FLAGSTONE-BLUE STONE TREADS","SF"]
["909.3010","PRECAST MEDIAN BARRIER DOUBLE-FACED STANDARD 40.1.0","LF"]
["909.3020","PRECAST MEDIAN BARRIER SINGLE-FACED STANDARD 40.2.0","LF"]
["909.3021","PRECAST MEDIAN BARRIER SINGLE-FACED STANDARD 40.2.1","LF"]
["909.3030","PRECAST MEDIAN BARRIER TRANSITION STANDARD 40.3.0","EACH"]
["909.3040","PRECAST MEDIAN BARRIER WITH LIGHT UNIT STANDARD 40.4.0","EACH"]
["910.2100","RAISED REFLECTORIZED PAVEMENT MARKERS (SNOW PLOWABLE)","EACH"]
["911.0100","WET STONE MASONRY RETAINING WALL STANDARD 10.1.0","CY"]
["911.0101","STONE MASONRY STEPS STANDARD 10.4.0","CY"]
["911.0102","STONE MASONRY HEADWALLS","CY"]
["911.0104","WET STONE MASONRY WALL","CY"]
["911.0107","CONCRETE MASONRY STEPS","CY"]
["911.2100","PRECAST CEMENT CONCRETE COPING","LF"]
["911.3100","REMOVE AND RESET WET STONE MASONRY RETAINING WALLS STANDARD 10.1.0","CY"]
["911.3200","REMOVE AND RESET WET STONE MASONRY WALLS","CY"]
["912.0100","REMOVE, REBUILD DRY STONE WALLS RUBBLE STANDARD 10.2.0","LF"]
["912.0101","REMOVE AND REBUILD DRY STONE WALLS CONNECTICUT FIELDSTONE","LF"]
["912.0102","CONSTRUCT NEW DRY-LAID STONE WALLS","LF"]
["912.0103","SUPPLEMENTARY STONES FOR WALLS","TON"]
["914.5010","FLAGPERSONS","MHRS"]
["914.5020","FLAGPERSONS - OVERTIME","MHRS"]
["915.0100","HIGHWAY BOUND GRANITE STANDARD 14.2.0","EACH"]
["915.0200","HIGHWAY BOUNDS REINFORCED CONCRETE STANDARD 14.1.0","EACH"]
["915.0220","REINFORCED CONCRETE HIGHWAY BOUND SET IN LEDGE STANDARDS 14.1.0 & 14.3.0","EACH"]
["915.0230","GRANITE HIGHWAY BOUND SET IN LEDGE STANDARDS 14.2.0 & 14.3.0","EACH"]
["915.0240","REMOVE AND RESET HIGHWAY BOUNDS (ALL TYPES)","EACH"]
["915.0500","PRECISE LEVEL MONUMENT REINFORCED CONCRETE W/ STANDARD BENCH MARK HEAD STANDARDS 14.4.0 & 14.4.1","EACH"]
["915.0510","PRECISE LEVEL MONUMENT REINF. CONCRETE W/ STANDARD MARKER TRIANGULATION STATION STANDARDS 14.4.0 & 14.4.2","EACH"]
["915.0520","GEODETIC SURVEY DISK STANDARD 14.4.3","EACH"]
["916.0600","SHOCK ABSORBING BARRIER MODULES","GRP"]
["916.0650","REMOVE, RELOCATE AND RESET SHOCK ABSORBING BARRIER MODULES","GRP"]
["916.0700","GUARDRAIL ENERGY ABSORBING TERMINAL IMPACT ATTENUATOR","EACH"]
["917.0105","REMOVE AND REPLACE RURAL MAILBOX POST WITH STANDARD 15.1.0","EACH"]
["917.0106","REMOVE AND REPLACE MULTIPLE MAILBOX MOUNTING WITH STANDARD 15.2.0","EACH"]
["918.0100","RURAL MAILBOXES","EACH"]
["918.0200","RURAL MAILBOXES 2-DOOR","EACH"]
["919.0101","TEST PITS","EACH"]
["920.0000","DUMPED STONE RIPRAP R-1, R-2 STANDARD 8.3.0","TON"]
["920.0005","DUMPED STONE RIPRAP R-3, R-4, R-5 STANDARD 8.3.0","TON"]
["920.0010","DUMPED STONE RIPRAP R-6,R-7,R-8","TON"]
["920.0020","PLACED STONE RIPRAP R-1, R-2 STANDARD 8.3.0","TON"]
["920.0025","PLACED STONE RIPRAP R-3, R-4, R-5  STANDARD 8.3.0","TON"]
["920.0030","PLACED STONE RIPRAP R-6,R-7,R-8","TON"]
["920.0035","DUMPED STONE RIPRAP R-1, R-2  STANDARD 8.3.0","SY"]
["920.0040","DUMPED STONE RIPRAP R-3, R-4, R-5 STANDARD 8.3.0","SY"]
["920.0045","DUMPED STONE RIPRAP R-6, R-7, R-8","SY"]
["920.0050","PLACED STONE RIPRAP R-1, R-2 STANDARD 8.3.0","SY"]
["920.0055","PLACED STONE RIPRAP R-3, R-4, R-5 STANDARD 8.3.0","SY"]
["920.0060","PLACED STONE RIPRAP R-6, R-7, R-8","SY"]
["920.0065","DUMPED STONE RIPRAP R-1, R-2 STANDARD  8.3.0","CY"]
["920.0070","DUMPED STONE RIPRAP R-3, R-4, 4-5 STANDARD 8.3.0","CY"]
["920.0075","DUMPED STONE RIPRAP R-6, R-7, R-8","CY"]
["920.0080","PLACED STONE RIPRAP R-1, R-2 STANDARD 8.3.0","CY"]
["920.0085","PLACED STONE RIPRAP R-3, R-4, R-5 STANDARD 8.3.0","CY"]
["920.0090","PLACED STONE RIPRAP R-6, R-7, R-8","CY"]
["920.0115","BEDDING FOR RIPRAP FS-1 STANDARD 8.3.0","TON"]
["920.0120","BEDDING FOR RIPRAP FS-2 STANDARD 8.3.0","TON"]
["920.0125","BEDDING FOR RIPRAP FS-3 STANDARD 8.3.0","TON"]
["920.0130","BEDDING FOR RIPRAP FS-1 STANDARD 8.3.0","SY"]
["920.0135","BEDDING FOR RIPRAP FS-2 STANDARD 8.3.0","SY"]
["920.0140","BEDDING FOR RIPRAP FS-3 STANDARD 8.3.0","SY"]
["920.0145","BEDDING FOR RIPRAP FS-1 STANDARD 8.3.0","CY"]
["920.0150","BEDDING FOR RIPRAP FS-2 STANDARD 8.3.0","CY"]
["920.0155","BEDDING FOR RIPRAP FS-3 STANDARD 8.3.0","CY"]
["920.0200","FILTER FABRIC FOR RIP-RAP","SY"]
["921.0100","SLOPE PAVING 16X8X4''","SY"]
["922.0100","TEMPORARY CONSTRUCTION SIGNS STANDARD 29.1.0 AND 27.1.1","SF"]
["923.0105","DRUM BARRICADE STANDARD 26.2.0","BDAY"]
["923.0120","PLASTIC PIPE BARRICADE STANDARD 26.3.0","EACH"]
["923.0125","PLASTIC PIPE TYPE III BARRICADE STANDARD 26.3.1","EACH"]
["923.0200","FLUORESCENT TRAFFIC CONES STANDARD 26.1.0","EACH"]
["924.0113","ADVANCE WARNING ARROW PANEL","PDAY"]
["925.0112","PORTABLE CHANGEABLE MESSAGE SIGN","PDAY"]
["926.0140","REFLECTIVE DELINEATORS FOR TEMPORARY CONCRETE BARRIERS","EACH"]
["926.0200","ANCHORED BARRIER FOR TEMPORARY TRAFFIC CONTROL","LF"]
["926.0210","UNANCHORED BARRIER FOR TEMPORARY TRAFFIC CONTROL STANDARD 40.5.0","LF"]
["928.0500","SHADOW OR ADVANCE WARNING VEHICLE WITH IMPACT ATTENUATOR AND FLASHING ARROW BOARD","HRS"]
["928.0510","SHADOW OR ADVANCE WARNING VEHICLE WITH IMPACT ATTENUATOR AND CHANGEABLE MESSAGE SIGN","HRS"]
["929.0110","FIELD OFFICE","PMO"]
["929.0210","MATERIALS LABORATORY","PMO"]
["931.0110","CLEANING AND SWEEPING PAVEMENT","HSY"]
["931.0130","CLEANING AND SWEEPING PAVEMENT FOR STATEWIDE STRIPING CONTRACTS","LF"]
["932.0100","CUTTING AND MATCHING ASPHALT","LF"]
["932.0101","CUTTING AND MATCHING CONCRETE","LF"]
["932.0110","TRANSVERSE PAVEMENT CUT AND MATCH STANDARD 47.1.1","LF"]
["932.0200","FULL-DEPTH SAWCUT OF BITUMINOUS PAVEMENT","LF"]
["932.0210","FULL DEPTH SAWCUT OF BITUMINOUS PAVEMENT AND RIGID BASE","LF"]
["932.0220","FULL DEPTH SAWCUT OF BITUMINOUS SIDEWALK/DRIVEWAY","LF"]
["932.0230","FULL DEPTH SAWCUT OF PORTLAND CEMENT CONCRETE SIDEWALK/DRIVEWAY","LF"]
["932.0400","COLD JOINT SAWING AND SEALING","LF"]
["933.0300","SAW CUTTING PAVEMENT FOR TRAFFIC COUNT LOOP DETECTORS","LF"]
["935.0200","SCARIFY AND RESHAPE EXISTING PAVEMENT","SY"]
["935.0400","REMOVING BITUMINOUS PAVEMENT BY MICRO MILLING","SY"]
["936.0100","MOBILIZATION AND DEMOBILIZATION","LS"]
["936.0110","MOBILIZATION","LS"]
["937.0200","MAINTENANCE AND MOVEMENT TRAFFIC PROTECTION","LS"]
["939.0100","STONE WALLS IN HISTORIC, SCENIC OR RURAL AREAS","CY"]
["939.0200","STONE WALLS IN HISTORIC, SCENIC OR RURAL AREAS (FREE STANDING,WET MASONRY)","CY"]
["939.0300","STONE WALLS IN HISTORIC, SCENIC OR RURAL AREAS (WET MASONRY RETAINING)","CY"]
["939.0400","STONE WALLS IN HISTORIC, SCENIC OR RURAL AREAS","LF"]
["939.0500","STONE WALLS IN HISTORIC, SCENIC OR RURAL AREAS (FREE-STANDING,DRY MASONRY)","LF"]
["942.0200","DETECTABLE WARNING PANEL STANDARD 48.1.0","SF"]
["943.0200","TRAINEE MAN-HOURS","MHRS"]
["944.0100","DIESEL EMISSION REDUCTION PROGRAM","LS"]
["945.0100","REMOVE AND DISPOSE TRAFFIC SIGNAL EQUIPMENT","LS"]
["945.0200","REMOVE AND SALVAGE TRAFFIC SIGNAL EQUIPMENT","LS"]
["945.0210","REMOVE AND SALVAGE TRAFFIC SIGNAL EQUIPMENT - NON PARTICIPATING","LS"]
["L01.0102","LOAM BORROW 4 INCHES DEEP","SY"]
["L01.0104","PLANTABLE SOIL 4 INCHES DEEP","SY"]
["L01.0106","HIGH ORGANIC SOIL 4 INCHES DEEP (SLOPES)","SY"]
["L01.0107","HIGH ORGANIC SOILS 6 INCHES DEEP (BOTTOM)","SY"]
["L02.0101","GENERAL HIGHWAY SEEDING (TYPE 1)","SY"]
["L02.0102","RESIDENTIAL SEEDING (TYPE 2)","SY"]
["L02.0103","TEMPORARY SEEDING (TYPE 3)","SY"]
["L02.0104","NATIVE SEED MIX (TYPE 4)","SY"]
["L02.0105","WETLAND SEED MIX (TYPE 5)","SY"]
["L02.0106","WILDFLOWER SEED MIX (TYPE 6)","SY"]
["L03.0201","SODDING LAWN SOD","SY"]
["L04.0514","FERTILIZATION OF SEEDED AND GRASSED AREAS","ACRE"]
["L05.0502","ADHESIVE MULCH STABILIZER","ACRE"]
["L05.0505","EROSION CONTROL BLANKET","SY"]
["L05.0506","JUTE MESH","SY"]
["L05.0507","EXCELSIOR MATTING","SY"]
["L05.0508","STRAW MULCH","ACRE"]
["L06.0101","OVERSIZED PLANTING HOLES","EACH"]
["L06.0201","TRANSPLANTING SHRUBS ALL TYPES AND SIZES","EACH"]
["L06.0202","TRANSPLANTING TREES ALL TYPES AND SIZES","EACH"]
["L06.0513","WOOD CHIPS FURNISH AND SPREAD 4'' DEPTH","SY"]
["L07.0100","EXTENDED ESTABLISHMENT PERIOD","PMO"]
["L08.0104","SHRUB OR VINE PRUNING","MHRS"]
["L08.0109","TREE TRIMMING","MHRS"]
["L08.0110","TREE TRIMMING FOR UTILITIES","CHRS"]
["L09.0106","SELECTIVE CLEARING","ACRE"]
["L10.0101","MECHANICAL TREE AND SHRUB ROOT PRUNING","LF"]
["L11.0102","TREE PLANT PROTECTION DEVICE STANDARD 51.1.0","EACH"]
["L11.0103","SHRUB PLANT PROTECTION DEVICE STANDARD 51.2.0","LF"]
["L11.0104","DRIP-LINE TREE PROTECTION DEVICE STANDARD 51.1.1","LF"]
["L12.0206","FURNISH AND INSTALL NEW BRICK PAVERS IN TREE CUT-OUTS STANDARD 50.1.2","SF"]
["L12.0207","FURNISH AND INSTALL NEW CONCRETE PAVERS IN TREE CUT-OUTS STANDARD 50.1.2","SF"]
["L12.0208","FURNISH AND INSTALL CUT GRANITE PAVERS IN TREE CUT-OUTS STANDARD 50.1.2","SF"]
["L12.0209","FURNISH AND INSTALL GRANITE COBBLE PAVERS IN TREE CUT-OUTS STANDARD 50.1.2","SF"]
["L13.0204","PARTIAL TREE WELL BLOCK CONSTRUCTION STANDARD 51.3.0","CY"]
["L13.0205","CIRCUMFERENTIAL TREE WELL BLOCK CONSTRUCTION STANDARD 51.3.0","CY"]
["L13.0206","TREE WALL STANDARD 51.4.0","CY"]
["L14.0107","PRE-EMERGENT HERBICIDE APPLICATION IN MULCH AREAS","SY"]
["L14.0108","NON-SELECTIVE AND PRE-EMERGENT HERBICIDE APPLICATION","SY"]
["T03.6003","GROUND RODS 3/4'' DIAMETER BY 10' COPPER CLAD STEEL INCLUDING CLAMPS","EACH"]
["T03.6005","GROUND RODS 5/8'' DIAMETER BY 10' COPPER CLAD STEEL INCLUDING CLAMPS","EACH"]
["T04.5001","6 AWG SINGLE CONDUCTOR CABLE 600V INSULATION","LF"]
["T04.5002","6 AWG 2 CONDUCTOR CABLE 600V INSULATION","LF"]
["T04.5101","8 AWG SINGLE CONDUCTOR CABLE 600V INSULATION","LF"]
["T04.5102","8 AWG 2 CONDUCTOR CABLE 600V INSULATION","LF"]
["T04.5202","12 AWG 2 CONDUCTOR CABLE","LF"]
["T04.5302","14 AWG 2 CONDUCTOR TWISTED SHIELDED CABLE","LF"]
["T04.5303","14 AWG 3 CONDUCTOR CABLE","LF"]
["T04.5305","14 AWG 5 CONDUCTOR CABLE","LF"]
["T04.5307","14 AWG 7 CONDUCTOR CABLE","LF"]
["T04.5309","14 AWG 9 CONDUCTOR CABLE","LF"]
["T04.5312","14 AWG 12 CONDUCTOR CABLE","LF"]
["T04.5315","14 AWG 15 CONDUCTOR CABLE","LF"]
["T04.5402","18 AWG 2 CONDUCTOR CABLE","LF"]
["T04.5403","18 AWG 3 CONDUCTOR CABLE","LF"]
["T04.5404","18 AWG 4 CONDUCTOR CABLE","LF"]
["T04.6900","'0' STRANDED COPPER CONDUCTOR 600V INSULATION","LF"]
["T04.6901","'1' STRANDED COPPER CONDUCTOR 600V INSULATION","LF"]
["T04.6902","'2' STRANDED COPPER CONDUCTOR 600V INSULATION","LF"]
["T04.6904","'4' STRANDED COPPER CONDUCTOR 600V INSULATION","LF"]
["T04.6906","'6' STRANDED COPPER CONDUCTOR 600V INSULATION","LF"]
["T04.6908","'8' STRANDED COPPER CONDUCTOR 600V INSULATION","LF"]
["T04.6910","'10' STRANDED COPPER CONDUCTOR 600V INSULATION","LF"]
["T04.6911","'00' STRANDED COPPER CONDUCTOR 600V INSULATION","LF"]
["T04.6912","'12' STRANDED COPPER CONDUCTOR 600V INSULATION","LF"]
["T04.6913","'000' STRANDED COPPER CONDUCTOR 600V INSULATION","LF"]
["T04.6914","'14' STRANDED COPPER CONDUCTOR 600V INSULATION","LF"]
["T04.7300","IN-LINE FUSED DISCONNECT DEVICE WITH FUSE WEATHERPROOF","EACH"]
["T04.7400","IN-LINE UNFUSED DISCONNECT DEVICE","EACH"]
["T04.7500","SPLICE KIT","EACH"]
["T05.0100","PRECAST TYPE A HANDHOLE STANDARD 18.2.0","EACH"]
["T05.0200","PRECAST TYPE H HEAVY DUTY HANDHOLE STANDARD 18.2.1","EACH"]
["T05.0300","PRECAST TYPE B HEAVY DUTY HANDHOLE STANDARD 18.2.2","EACH"]
["T05.0310","PULL BOX ON STRUCTURE TYPE W STANDARD 18.6.3","EACH"]
["T05.0320","PULL BOX ON STRUCTURE TYPE V STANDARD 18.6.3","EACH"]
["T05.0400","BREAK INTO EXISTING HANDHOLE","EACH"]
["T05.0500","FIBER OPTIC HANDHOLE","EACH"]
["T05.0510","FIBER OPTIC MANHOLE","EACH"]
["T05.1030","ADJUST HANDHOLE TO GRADE","EACH"]
["T06.1015","1-1/2 IN. RIGID STEEL CONDUIT - UNDERGROUND","LF"]
["T06.1020","2 IN. RIGID STEEL CONDUIT - UNDERGROUND","LF"]
["T06.1030","3 IN. RIGID STEEL CONDUIT-UNDERGROUND","LF"]
["T06.1040","4 IN. RIGID STEEL CONDUIT-UNDERGROUND","LF"]
["T06.2015","1-1/2 IN. RIGID STEEL CONDUIT-OVERHEAD","LF"]
["T06.2020","2 IN. RIGID STEEL CONDUIT-OVERHEAD","LF"]
["T06.2030","3 IN. RIGID STEEL CONDUIT-OVERHEAD","LF"]
["T06.2040","4 IN. RIGID STEEL CONDUIT-OVERHEAD","LF"]
["T06.3015","1-1/2 IN. RIGID STEEL CONDUIT-UNDER EXISTING PAVEMENT","LF"]
["T06.3020","2 IN. RIGID STEEL CONDUIT-UNDER EXISTING PAVEMENT","LF"]
["T06.3030","3 IN. RIGID STEEL CONDUIT-UNDER EXISTING PAVEMENT","LF"]
["T06.3040","4 IN. RIGID STEEL CONDUIT-UNDER EXISTING PAVEMENT","LF"]
["T06.4010","1 IN. RIGID STEEL CONDUIT IN STRUCTURE","LF"]
["T06.4015","1-1/2 IN. RIGID STEEL CONDUIT IN STRUCTURE","LF"]
["T06.4020","2 IN. RIGID STEEL CONDUIT IN STRUCTURE","LF"]
["T06.4030","3 IN. RIGID STEEL CONDUIT IN STRUCTURE","LF"]
["T06.4040","4 INCH RIGID STEEL CONDUIT IN STRUCTURE","LF"]
["T06.5110","1 INCH SCHEDULE 40 POLYVINYL CHLORIDE PLASTIC CONDUIT - UNDERGROUND","LF"]
["T06.5120","2 INCH SCHEDULE 40 POLYVINYL CHLORIDE PLASTIC CONDUIT - UNDERGROUND","LF"]
["T06.5130","3 INCH SCHEDULE 40 POLYVINYL CHLORIDE PLASTIC CONDUIT - UNDERGROUND","LF"]
["T06.5140","4 INCH SCHEDULE 40 POLYVINYL CHLORIDE PLASTIC CONDUIT - UNDERGROUND","LF"]
["T06.5210","1 INCH SCHEDULE 80 POLYVINYL CHLORIDE PLASTIC CONDUIT - UNDERGROUND","LF"]
["T06.5220","2 INCH SCHEDULE 80 POLYVINYL CHLORIDE PLASTIC CONDUIT - UNDERGROUND","LF"]
["T06.5230","3 INCH SCHEDULE 80 POLYVINYL CHLORIDE PLASTIC CONDUIT - UNDERGROUND","LF"]
["T06.5240","4 INCH SCHEDULE 80 POLYVINYL CHLORIDE PLASTIC CONDUIT - UNDERGROUND","LF"]
["T06.5310","1 INCH SCHEDULE 40 POLYVINYL CHLORIDE PLASTIC CONDUIT - UNDER EXISTING PAVEMENT","LF"]
["T06.5320","2 INCH SCHEDULE 40 POLYVINYL CHLORIDE PLASTIC CONDUIT - UNDER EXISTING PAVEMENT","LF"]
["T06.5330","3 INCH SCHEDULE 40 POLYVINYL CHLORIDE PLASTIC CONDUIT - UNDER EXISTING PAVEMENT","LF"]
["T06.5340","4 INCH SCHEDULE 40 POLYVINYL CHLORIDE PLASTIC CONDUIT - UNDER EXISTING PAVEMENT","LF"]
["T06.5410","1 INCH SCHEDULE 80 POLYVINYL CHLORIDE PLASTIC CONDUIT - UNDER EXISTING PAVEMENT","LF"]
["T06.5420","2 INCH SCHEDULE 80 POLYVINYL CHLORIDE PLASTIC CONDUIT - UNDER EXISTING PAVEMENT","LF"]
["T06.5430","3 INCH SCHEDULE 80 POLYVINYL CHLORIDE PLASTIC CONDUIT - UNDER EXISTING PAVEMENT","LF"]
["T06.5440","4 INCH SCHEDULE 80 POLYVINYL CHLORIDE PLASTIC CONDUIT - UNDER EXISTING PAVEMENT","LF"]
["T06.6015","1-1/2 INCH POLYVINYL CHLORIDE PLASTIC CONDUIT-OVERHEAD","LF"]
["T06.6020","2 INCH POLYVINYL CHLORIDE PLASTIC CONDUIT-OVERHEAD","LF"]
["T06.6030","3 INCH POLYVINYL CHLORIDE PLASTIC CONDUIT-OVERHEAD","LF"]
["T06.6040","4 INCH POLYVINYL CHLORIDE PLASTIC CONDUIT-OVERHEAD","LF"]
["T06.6115","1-1/2 INCH POLYVINYL CHLORIDE PLASTIC CONDUIT IN STRUCTURE","LF"]
["T06.6120","2 INCH POLYVINYL CHLORIDE PLASTIC CONDUIT IN STRUCTURE","LF"]
["T06.6130","3 INCH POLYVINYL CHLORIDE PLASTIC CONDUIT IN STRUCTURE","LF"]
["T06.6140","4 INCH POLYVINYL CHLORIDE PLASTIC CONDUIT IN STRUCTURE","LF"]
["T06.7002","EXPANSION COUPLING WITH TRANSVERSE MOTION 2'' STEEL","EACH"]
["T06.7003","EXPANSION COUPLING WITH TRANSVERSE MOTION 3'' STEEL","EACH"]
["T06.7032","EXPANSION COUPLING WITH TRANSVERSE MOTION 2” FIBERGLASS","EACH"]
["T06.7033","EXPANSION COUPLING WITH TRANSVERSE MOTION 3” FIBERGLASS","EACH"]
["T06.7034","EXPANSION COUPLING WITH TRANSVERSE MOTION 4” FIBERGLASS","EACH"]
["T06.7042","EXPANSION COUPLING WITH TRANSVERSE MOTION 2” PVC","EACH"]
["T06.7043","EXPANSION COUPLING WITH TRANSVERSE MOTION 3\" PVC","EACH"]
["T06.7044","EXPANSION COUPLING WITH TRANSVERSE MOTION 4\" PVC","EACH"]
["T06.7102","EXPANSION COUPLING WITHOUT TRANSVERSE MOTION 2'' STEEL","EACH"]
["T06.7103","EXPANSION COUPLING WITHOUT TRANSVERSE MOTION 3'' STEEL","EACH"]
["T06.7122","EXPANSION COUPLING WITHOUT TRANSVERSE MOTION 2\" FIBERGLASS","EACH"]
["T06.7123","EXPANSION COUPLING WITHOUT TRANSVERSE MOTION 3\" FIBERGLASS","EACH"]
["T06.7124","EXPANSION COUPLING WITHOUT TRANSVERSE MOTION 4\" FIBERGLASS","EACH"]
["T06.8020","2 INCH FIBERGLASS CONDUIT ON STRUCTURE","LF"]
["T06.8030","3 INCH FIBERGLASS CONDUIT ON STRUCTURE","LF"]
["T06.8040","4 INCH FIBERGLASS CONDUIT ON STRUCTURE","LF"]
["T07.0100","UNDERSTRUCTURE LUMINAIRE WITH OR WITHOUT PROTECTIVE SCREEN","EACH"]
["T07.1250","FURNISH AND INSTALL 250 WATT HIGH PRESSURE SODIUM LUMINAIRE","EACH"]
["T07.1400","FURNISH AND INSTALL 400 WATT HIGH PRESSURE SODIUM LUMINAIRE","EACH"]
["T08.0050","F&I BREAKAWAY SUPPORT COUPLINGS ON EXISTING LIGHT STANDARD FOUNDATIONS STANDARD 18.3.4","EACH"]
["T08.0100","LIGHT STANDARD FOUNDATION WITH ANCHOR BOLTS STANDARD 18.1.0","EACH"]
["T08.0200","LIGHT STANDARD ANCHORAGES ON BRIDGES","EACH"]
["T08.0250","LUMINAIRE SUPPORT UNDER STRUCTURE","EACH"]
["T08.1700","REMOVE AND RELOCATE LIGHT STANDARD","EACH"]
["T08.1701","REMOVE AND RELOCATE LIGHT STANDARD BASES","EACH"]
["T08.2031","ALUMINUM LIGHTING STD. 30 FT. W/ SINGLE DAVIT ARM EXTN. 10 FT. STANDARD 18.3.0","EACH"]
["T08.2032","ALUM. LIGHTING STD. 30 FT. W/ DOUBLE DAVIT ARM EXTN. 10X10 FT. STANDARD 18.3.0","EACH"]
["T08.2041","ALUMINUM LIGHTING STD. 40 FT. W/ SINGLE DAVIT ARM EXTN. 10 FT. STANDARD 18.3.0","EACH"]
["T08.2042","ALUM. LIGHTING STD. 40 FT. W/ DOUBLE DAVIT ARM EXTN. 10X10 FT. STANDARD 18.3.0","EACH"]
["T09.1000","SERVICE PEDESTAL STANDARD 18.4.0","EACH"]
["T11.0100","ANCHOR GUY ASSEMBLY CONSTRUCTED IN PLACE","EACH"]
["T11.0130","TRAFFIC SIGNAL STANDARD, WOOD, 30 FT. CLASS 3","EACH"]
["T11.0820","20 FOOT STANDARD LOAD STEEL TRAFFIC SIGNAL MAST ARM, POLE AND FOUNDATION STANDARD 19.2.0","EACH"]
["T11.0825","25 FOOT STANDARD LOAD STEEL TRAFFIC SIGNAL MAST ARM, POLE AND FOUNDATION STANDARD 19.2.0","EACH"]
["T11.0830","30 FOOT STANDARD LOAD STEEL TRAFFIC SIGNAL MAST ARM, POLE AND FOUNDATION STANDARD 19.2.0","EACH"]
["T11.0835","35 FOOT STANDARD LOAD STEEL TRAFFIC SIGNAL MAST ARM, POLE AND FOUNDATION STANDARD 19.2.0","EACH"]
["T11.0840","40 FOOT STANDARD LOAD STEEL TRAFFIC SIGNAL MAST ARM, POLE AND FOUNDATION STANDARD 19.2.0","EACH"]
["T11.0845","45 FOOT STANDARD LOAD STEEL TRAFFIC SIGNAL MAST ARM, POLE AND FOUNDATION STANDARD 19.2.0","EACH"]
["T11.0850","50 FOOT STANDARD LOAD STEEL TRAFFIC SIGNAL MAST ARM, POLE AND FOUNDATION STANDARD 19.2.0","EACH"]
["T11.0930","30 FOOT HEAVY LOAD STEEL TRAFFIC SIGNAL MAST ARM, POLE AND FOUNDATION STANDARD 19.2.0","EACH"]
["T11.0935","35 FOOT HEAVY LOAD STEEL TRAFFIC SIGNAL MAST ARM, POLE AND FOUNDATION STANDARD 19.2.0","EACH"]
["T11.0940","40 FOOT HEAVY LOAD STEEL TRAFFIC SIGNAL MAST ARM, POLE AND FOUNDATION STANDARD 19.2.0","EACH"]
["T11.0945","45 FOOT HEAVY LOAD STEEL TRAFFIC SIGNAL MAST ARM, POLE AND FOUNDATION STANDARD 19.2.0","EACH"]
["T11.0950","50 FOOT HEAVY LOAD STEEL TRAFFIC SIGNAL MAST ARM, POLE AND FOUNDATION STANDARD 19.2.0","EACH"]
["T11.1202","DUAL MAST ARM (20X20) GAL STEEL TRAFFIC SIGNAL POST AND FOUNDATION STD 19.2.0","EACH"]
["T11.1203","DUAL MAST ARM (20X25) GAL STEEL TRAFFIC SIGNAL POST AND FOUNDATION STD 19.2.0","EACH"]
["T11.1207","DUAL MAST ARM (20X30) GAL STEEL TRAFFIC SIGNAL POST AND FOUNDATION STD 19.2.0","EACH"]
["T11.1208","DUAL MAST ARM (20X35) GAL STEEL TRAFFIC SIGNAL POST AND FOUNDATION STD. 19.2.0","EACH"]
["T11.1253","DUAL MAST ARM (25X25) GAL STEEL TRAFFIC SIGNAL POST AND FOUNDATION STD 19.2.0","EACH"]
["T11.1257","DUAL MAST ARM (25X30) GAL STEEL TRAFFIC SIGNAL POST AND FOUNDATION STD 19.2.0","EACH"]
["T11.1258","DUAL MAST ARM (25X35) GAL STEEL TRAFFIC SIGNAL POST AND FOUNDATION STD 19.2.0","EACH"]
["T11.1303","DUAL MAST ARM (30X30) GAL STEEL TRAFFIC SIGNAL POST AND FOUNDATION STD 19.2.0","EACH"]
["T11.1304","DUAL MAST ARM (30X35) GAL STEEL TRAFFIC SIGNAL POST AND FOUNDATION STD 19.2.0","EACH"]
["T11.1308","DUAL MAST ARM (30X40) GAL STEEL TRAFFIC SIGNAL POST AND FOUNDATION STD 19.2.0","EACH"]
["T11.1354","DUAL MAST ARM (35X35) GAL STEEL TRAFFIC SIGNAL POST AND FOUNDATION STD 19.2.0","EACH"]
["T11.1358","DUAL MAST ARM (35X40) GAL STEEL TRAFFIC SIGNAL POST AND FOUNDATION STD 19.2.0","EACH"]
["T11.1359","DUAL MAST ARM (35X45) GAL STEEL TRAFFIC SIGNAL POST AND FOUNDATION STD 19.2.0","EACH"]
["T11.1404","DUAL MAST ARM (40X40) GAL STEEL TRAFFIC SIGNAL POST AND FOUNDATION STD 19.2.0","EACH"]
["T11.2008","TRAFFIC SIGNAL STANDARD,8 FOOT,STD 19.4.0 ALUMINUM PEDESTAL POLE AND FOUNDATION","EACH"]
["T11.2010","TRAFFIC SIGNAL STANDARD,10 FT, STD 19.4.0 ALUMINUM PEDESTAL POLE AND FOUNDATION","EACH"]
["T11.2012","TRAFFIC SIGNAL STANDARD,12 FT,STD 19.4.0 ALUMINUM PEDESTAL POLE AND FOUNDATION","EACH"]
["T11.2510","STEEL TRAFFIC SIGNAL SPAN POLE AND FOUNDATION STANDARD 19.3.0","EACH"]
["T11.6005","TETHER WIRE 5/16","LF"]
["T11.6006","SPAN AND MESSENGER WIRES 6/16","LF"]
["T11.6007","SPAN AND MESSENGER WIRES 7/16","LF"]
["T12.0004","ACTUATED CONTROLLER TS-2, TYPE 1 W/4 PHASE ASSEMBLY POLE MOUNTED INCLUDING CABINET STD. 19.1.1","EACH"]
["T12.0014","ACTUATED CONTROLLER TS-2, TYPE 1 W/4 PHASE ASSEMBLY GROUND MOUNTED INCLUDING FOUNDATION AND CABINET STD. 19.1.0","EACH"]
["T12.0018","ACTUATED CONTROLLER TS-2, TYPE 1 W/8 PHASE ASSEMBLY GROUND MOUNTED INCLUDING FOUNDATION AND CABINET STD. 19.1.0","EACH"]
["T12.1000","TWO CIRCUIT FLASHER","EACH"]
["T12.1001","SINGLE CIRCUIT FLASHER SOLID STATE","EACH"]
["T12.1002","DOUBLE CIRCUIT FLASHER SOLID STATE","EACH"]
["T12.1012","DOUBLE CIRCUIT FLASHER SOLID STATE, POLE MOUNTED INCLUDING CABINET","EACH"]
["T12.9100","METER SOCKET","EACH"]
["T12.9150","METER SOCKET W/MANUAL BY-PASS","EACH"]
["T12.9170","3 WIRE 120/240METER SOCKET WITH MANUAL BYPASS","EACH"]
["T13.1000","TRAFFIC DETECTORS-LOOP, STANDARD 19.6.0","LF"]
["T13.1002","TRAFFIC DETECTOR RELAY-LOOP 2 CHANNEL","EACH"]
["T13.1004","TRAFFIC DETECTOR RELAY-LOOP 4 CHANNEL","EACH"]
["T13.8200","PEDESTRIAN DETECTOR-PUSHBUTTON W/SIGN","EACH"]
["T13.8210","ACCESSIBLE PEDESTRIAN DETECTOR - PUSHBUTTON WITH SIGN","EACH"]
["T14.3401","F&I 1 SECTION DUAL IND DUAL ROW L.E.D. ARROW 12 INCH TO EXISTING SIGNAL HEAD  (SPAN MTD)","EACH"]
["T14.3411","1 WAY 1 SECTION SPAN MOUNTED SIGNAL HEAD 12 INCH","EACH"]
["T14.3413","1 WAY 3 SECTION SPAN MOUNTED SIGNAL HEAD 12 INCH","EACH"]
["T14.3416","1 WAY 4 SECTION SPAN MOUNTED SIGNAL HEAD 12 INCH (W/DUAL IND DUAL ROW L.E.D. ARROW)","EACH"]
["T14.3417","1 WAY 3 SECTION SPAN MOUNTED SIGNAL HEAD 2-12 INCH SECTIONS, 1-8 INCH SECTION","EACH"]
["T14.3421","2 WAY 1 SECTION SPAN MOUNTED SIGNAL HEAD 12 INCH","EACH"]
["T14.3423","2 WAY 3 SECTION SPAN MOUNTED SIGNAL HEAD 12 INCH","EACH"]
["T14.3424","2 WAY, 1-3 SECTION, 1-4 SECTION SPAN MTD SIGNAL HEAD 12 INCH (W/ DUAL IND DUAL ROW L.E.D. ARROW)","EACH"]
["T14.3425","2 WAY 4 SECTION SPAN MOUNTED SIGNAL HEAD 12 INCH (W/2 DUAL IND DUAL ROW L.E.D.  ARROWS)","EACH"]
["T14.3431","3 WAY 1 SECTION SPAN MOUNTED SIGNAL HEAD 12 INCH","EACH"]
["T14.3433","3 WAY 3 SECTION SPAN MOUNTED SIGNAL HEAD 12 INCH","EACH"]
["T14.3434","3 WAY, 2-3 SECTION, 1-4 SECTION SPAN MTD SIGNAL HEAD 12 INCH (W/ DUAL IND DUAL ROW L.E.D. ARROW)","EACH"]
["T14.3435","3 WAY, 1-3 SECTION, 2-4 SECTION SPAN MTD SIGNAL HEAD 12 INCH (W/2 DUAL IND DUAL ROW L.E.D. ARROWS)","EACH"]
["T14.3441","4 WAY 1 SECTION SPAN MOUNTED SIGNAL HEAD 12 INCH","EACH"]
["T14.3443","4 WAY 3 SECTION SPAN MOUNTED SIGNAL HEAD 12 INCH","EACH"]
["T14.3444","4 WAY, 3-3 SECTION, 1-4 SECTION SPAN MTD SIGNAL HEAD 12 INCH (W/ DUAL IND, DUAL ROW L.E.D. ARROW)","EACH"]
["T14.3445","4 WAY, 2-3 SECTION, 2-4 SECTION SPAN MTD SIGNAL HEAD 12 INCH (W/2 DUAL IND, DUAL ROW L.E.D. ARROW)","EACH"]
["T14.3502","F&I 1 SECTION DUAL IND DUAL ROW L.E.D. ARROW 12 INCH TO EXISTING SIGNAL HEAD (MAST ARM MOUNTED)","EACH"]
["T14.3511","1 WAY 1 SECTION MAST ARM MOUNTED SIGNAL HEAD 12 INCH","EACH"]
["T14.3513","1 WAY 3 SECTION MAST ARM MOUNTED SIGNAL HEAD 12 INCH","EACH"]
["T14.3516","1 WAY 4 SECTION MAST ARM MOUNTED SIGNAL HEAD 12 INCH (W/ DUAL IND DUAL ROW L.E.D.  ARROW)","EACH"]
["T14.3517","1 WAY 3 SECTION MAST ARM MTD SIGNAL HEAD 2-12 INCH SECTIONS, 1-8 INCH SECTION","EACH"]
["T14.3531","3 WAY 1 SECTION MAST ARM MOUNTED SIGNAL HEAD 12 INCH","EACH"]
["T14.3601","F&I 1 SECTION DUAL IND DUAL ROW L.E.D. ARROW 12 INCH TO EXISTING SIGNAL HEAD  (BRACKET MOUNTED)","EACH"]
["T14.3611","1 WAY 1 SECTION BRACKET MOUNTED SIGNAL HEAD 12 INCH","EACH"]
["T14.3613","1 WAY 3 SECTION BRACKET MOUNTED SIGNAL HEAD 12 INCH","EACH"]
["T14.3615","1 WAY 4 SECTION BRACKET MOUNTED SIGNAL HEAD 12 INCH (W/DUAL IND DUAL ROW L.E.D. ARROW)","EACH"]
["T14.3701","F&I 1 SECTION DUAL IND DUAL ROW L.E.D. ARROW 12 INCH TO EXISTING SIGNAL HEAD (PEDESTAL MOUNTED)","EACH"]
["T14.3713","1 WAY 3 SECTION PEDESTAL MOUNTED SIGNAL HEAD 12 INCH","EACH"]
["T14.3715","1 WAY 4 SECTION PEDESTAL MOUNTED SIGNAL HEAD 12 INCH (W/DUAL IND DUAL ROW L.E.D. ARROW)","EACH"]
["T14.3911","1 WAY PEDESTAL MOUNTED L.E.D. PEDESTRIAN SIGNAL HEAD  12 INCH","EACH"]
["T14.3912","2 WAY PEDESTAL MOUNTED L.E.D. PEDESTRIAN SIGNAL HEAD  12 INCH","EACH"]
["T14.3913","1 WAY BRACKET MOUNTED L.E.D. PEDESTRIAN SIGNAL HEAD  12 INCH","EACH"]
["T15.0100","DIRECTIONAL REGULATORY AND WARNING SIGNS","SF"]
["T15.0110","GUIDE SIGNS STANDARD 29.2.0","SF"]
["T15.0200","REMOVE AND RELOCATE DIRECTIONAL REGULATORY AND WARNING SIGN","EACH"]
["T15.1000","STREET SIGN ASSEMBLY STD.  24.6.1","EACH"]
["T15.1100","STREET SIGN - OVERHEAD MOUNTED","EACH"]
["T15.2000","PARKING SIGNS","SF"]
["T16.0100","GROUND MOUNTED PRIMARY DIRECTIONAL SIGN PANELS EXTRUDED ALUMINUM","SF"]
["T16.0200","REMOVE AND RELOCATE GROUND MOUNTED SIGN","EACH"]
["T16.0300","GROUND MOUNTED PRIMARY DIRECTIONAL SIGN POST-STEEL BREAKAWAY","EACH"]
["T17.0100","OVERHEAD SIGN PANELS","SF"]
["T17.0201","OVERHEAD SIGN STRUCTURE UNDER 20 FOOT CANTILEVER - STEEL","EACH"]
["T17.0202","OVERHEAD SIGN STRUCTURE 21-25 FOOT CANTILEVER- STEEL","EACH"]
["T17.0203","OVERHEAD SIGN STRUCTURE 26-30 FOOT CANTILEVER - STEEL","EACH"]
["T17.0204","OVERHEAD SIGN STRUCTURE 31-35 FOOT CANTILEVER  - STEEL","EACH"]
["T17.0205","OVERHEAD SIGN STRUCTURE 36-40 FOOT CANTILEVER - STEEL","EACH"]
["T17.0209","OVERHEAD SIGN STRUCTURE 56-60 FOOT SPAN - STEEL","EACH"]
["T17.0210","OVERHEAD SIGN STRUCTURE 61-65 FOOT SPAN - STEEL","EACH"]
["T17.0211","OVERHEAD SIGN STRUCTURE 66-70 FOOT SPAN - STEEL","EACH"]
["T17.0212","OVERHEAD SIGN STRUCTURE 71-75 FOOT SPAN - STEEL","EACH"]
["T17.0213","OVERHEAD SIGN STRUCTURE 76-80 FOOT SPAN - STEEL","EACH"]
["T17.0214","OVERHEAD SIGN STRUCTURE 81-85 FOOT SPAN - STEEL","EACH"]
["T17.0215","OVERHEAD SIGN STRUCTURE 86-90 FOOT SPAN - STEEL","EACH"]
["T17.0216","OVERHEAD SIGN STRUCTURE 91-95 FOOT SPAN - STEEL","EACH"]
["T17.0217","OVERHEAD SIGN STRUCTURE 96-100 FOOT SPAN - STEEL","EACH"]
["T17.0300","OVERHEAD SIGN STRUCTURE - BRIDGE MOUNTED","EACH"]
["T18.0100","FLEXIBLE DELINEATOR POST","EACH"]
["T18.0201","REFLECTOR UNIT-SINGLE WHITE DELINEATOR","EACH"]
["T18.0212","REFLECTOR UNIT-DOUBLE AMBER DELINEATOR 4X8''","EACH"]
["T18.0213","REFLECTOR UNIT-TRIPLE AMBER DELINEATOR 4 X 12''","EACH"]
["T18.0324","24 INCH HAZARD MARKER","EACH"]
["T18.0330","30 INCH HAZARD MARKER","EACH"]
["T18.0336","36 INCH HAZARD MARKER","EACH"]
["T18.0348","48 INCH HAZARD MARKER","EACH"]
["T19.0100","MILE POST MARKER 10'' X 18''","EACH"]
["T19.0200","MILE POST MARKER 10'' X 27''","EACH"]
["T20.0704","4 INCH WHITE WATERBORNE PAINT PAVEMENT MARKINGS","LF"]
["T20.0706","6 INCH WHITE WATERBORNE PAINT PAVEMENT MARKINGS","LF"]
["T20.0708","8 INCH WHITE WATERBORNE PAINT PAVEMENT MARKINGS","LF"]
["T20.0712","12 INCH WHITE WATERBORNE PAINT PAVEMENT MARKINGS","LF"]
["T20.0724","24 INCH WHITE WATERBORNE PAINT PAVEMENT MARKINGS","LF"]
["T20.0900","BI-DIRECTIONAL CONTROL DEVICE STANDARD 20.2.0","EACH"]
["T20.0904","4 INCH YELLOW WATERBORNE PAINT PAVEMENT MARKINGS","LF"]
["T20.0906","6 INCH YELLOW WATERBORNE PAINT PAVEMENT MARKINGS","LF"]
["T20.0908","8 INCH YELLOW WATERBORNE PAINT PAVEMENT MARKINGS","LF"]
["T20.0912","12 INCH YELLOW WATERBORNE PAINT PAVEMENT MARKINGS","LF"]
["T20.0924","24 INCH YELLOW WATERBORNE PAINT PAVEMENT MARKINGS","LF"]
["T20.1401","WATERBORNE PAINT PAVEMENT MARKING SYMBOL - ARROW (STRAIGHT, LEFT, RIGHT OR COMBINED) STANDARD 20.1.0","EACH"]
["T20.1402","WATERBORNE PAINT PAVEMENT MARKING SYMBOL - ROUNDABOUT APPROACH ARROW (STRAIGHT, LEFT, RIGHT OR COMBINED)","EACH"]
["T20.1403","WATERBORNE PAINT PAVEMENT MARKING SYMBOL - LANE REDUCTION ARROW (LEFT OR RIGHT)","EACH"]
["T20.1405","WATERBORNE PAINT PAVEMENT MARKING SYMBOL - YIELD LINE TRIANGLE (ALL SIZES)","EACH"]
["T20.1407","WATERBORNE PAINT PAVEMENT MARKING SYMBOL - PEDESTRIAN","EACH"]
["T20.1410","WATERBORNE PAINT PAVEMENT MARKING WORD (\"ONLY\", \"STOP\", \"YIELD\", \"AHEAD\", \"XING\", \"SCHOOL\", OR OTHER) STANDARD 20.1.0","EACH"]
["T20.1415","WATERBORNE PAINT PAVEMENT MARKING SYMBOL SET - HIGHWAY-RAIL GRADE CROSSING (R, X, AND R LETTERS)","EACH"]
["T20.1416","WATERBORNE PAINT PAVEMENT MARKING SYMBOL SET -  BIKE LANE (HELMETED BICYCLIST AND ARROW)","EACH"]
["T20.1417","WATERBORNE PAINT PAVEMENT MARKING SYMBOL SET - SHARED LANE MARKING FOR BICYCLES","EACH"]
["T20.1418","WATERBORNE PAINT PAVEMENT MARKING SYMBOL SET - BICYCLE DETECTOR","EACH"]
["T20.1420","WATERBORNE PAINT PAVEMENT MARKING SYMBOL - ELONGATED ROUTE SHIELD (STATE ROUTE)","EACH"]
["T20.2404","4 INCH WHITE FINAL EPOXY RESIN PAVEMENT MARKINGS","LF"]
["T20.2406","6 INCH WHITE FINAL EPOXY RESIN PAVEMENT MARKINGS","LF"]
["T20.2408","8 INCH WHITE FINAL EPOXY RESIN PAVEMENT MARKINGS","LF"]
["T20.2412","12 INCH WHITE FINAL EPOXY RESIN PAVEMENT MARKINGS","LF"]
["T20.2424","24 INCH WHITE FINAL EPOXY RESIN PAVEMENT MARKINGS","LF"]
["T20.2504","4 INCH WHITE INTERIM EPOXY RESIN PAVEMENT MARKINGS","LF"]
["T20.2506","6 INCH WHITE INTERIM EPOXY RESIN PAVEMENT MARKINGS","LF"]
["T20.2508","8 INCH WHITE INTERIM EPOXY RESIN PAVEMENT MARKINGS","LF"]
["T20.2512","12 INCH WHITE INTERIM EPOXY RESIN PAVEMENT MARKINGS","LF"]
["T20.2524","24 INCH WHITE INTERIM EPOXY RESIN PAVEMENT MARKINGS","LF"]
["T20.2604","4 INCH WHITE FINAL EPOXY RESIN PAVEMENT MARKINGS","HLF"]
["T20.2606","6 INCH WHITE FINAL EPOXY RESIN PAVEMENT MARKINGS","HLF"]
["T20.2608","8 INCH WHITE FINAL EPOXY RESIN PAVEMENT MARKINGS","HLF"]
["T20.2612","12 INCH WHITE FINAL EPOXY RESIN PAVEMENT MARKINGS","HLF"]
["T20.2624","24 INCH WHITE FINAL EPOXY RESIN PAVEMENT MARKINGS","HLF"]
["T20.2704","4 INCH WHITE FINAL EPOXY RESIN PAVEMENT MARKINGS","LS"]
["T20.2706","6 INCH WHITE FINAL EPOXY RESIN PAVEMENT MARKINGS","LS"]
["T20.2708","8 INCH WHITE FINAL EPOXY RESIN PAVEMENT MARKINGS","LS"]
["T20.2712","12 INCH WHITE FINAL EPOXY RESIN PAVEMENT MARKINGS","LS"]
["T20.2724","24 INCH WHITE FINAL EPOXY RESIN PAVEMENT MARKINGS","LS"]
["T20.2804","4 INCH YELLOW FINAL EPOXY RESIN PAVEMENT MARKINGS","LF"]
["T20.2806","6 INCH YELLOW FINAL EPOXY RESIN PAVEMENT MARKINGS","LF"]
["T20.2808","8 INCH YELLOW FINAL EPOXY RESIN PAVEMENT MARKINGS","LF"]
["T20.2812","12 INCH YELLOW FINAL EPOXY RESIN PAVEMENT MARKINGS","LF"]
["T20.2824","24 INCH YELLOW FINAL EPOXY RESIN PAVEMENT MARKINGS","LF"]
["T20.2904","4 INCH YELLOW INTERIM EPOXY RESIN PAVEMENT MARKINGS","LF"]
["T20.2906","6 INCH YELLOW INTERIM EPOXY RESIN PAVEMENT MARKINGS","LF"]
["T20.2908","8 INCH YELLOW INTERIM EPOXY RESIN PAVEMENT MARKINGS","LF"]
["T20.2912","12 INCH YELLOW INTERIM EPOXY RESIN PAVEMENT MARKINGS","LF"]
["T20.2924","24 INCH YELLOW INTERIM EPOXY RESIN PAVEMENT MARKINGS","LF"]
["T20.3004","4 INCH YELLOW FINAL EPOXY RESIN PAVEMENT MARKINGS","HLF"]
["T20.3006","6 INCH YELLOW FINAL EPOXY RESIN PAVEMENT MARKINGS","HLF"]
["T20.3008","8 INCH YELLOW FINAL EPOXY RESIN PAVEMENT MARKINGS","HLF"]
["T20.3012","12 INCH YELLOW FINAL EPOXY RESIN PAVEMENT MARKINGS","HLF"]
["T20.3024","24 INCH YELLOW FINAL EPOXY RESIN PAVEMENT MARKINGS","HLF"]
["T20.3104","4 INCH YELLOW FINAL EPOXY RESIN PAVEMENT MARKINGS","LS"]
["T20.3106","6 INCH YELLOW FINAL EPOXY RESIN PAVEMENT MARKINGS","LS"]
["T20.3108","8 INCH YELLOW FINAL EPOXY RESIN PAVEMENT MARKINGS","LS"]
["T20.3112","12 INCH YELLOW FINAL EPOXY RESIN PAVEMENT MARKINGS","LS"]
["T20.3124","24 INCH YELLOW FINAL EPOXY RESIN PAVEMENT MARKINGS","LS"]
["T20.3401","FINAL EPOXY RESIN PAVEMENT MARKING SYMBOL - ARROW (STRAIGHT, LEFT, RIGHT OR COMBINED) STANDARD 20.1.0","EACH"]
["T20.3402","FINAL EPOXY RESIN PAVEMENT MARKING SYMBOL - ROUNDABOUT APPROACH ARROW (STRAIGHT, LEFT, RIGHT OR COMBINED)","EACH"]
["T20.3403","FINAL EPOXY RESIN PAVEMENT MARKING SYMBOL - LANE REDUCTION ARROW (LEFT OR RIGHT)","EACH"]
["T20.3405","FINAL EPOXY RESIN PAVEMENT MARKING SYMBOL - YIELD LINE TRIANGLE (ALL SIZES)","EACH"]
["T20.3407","FINAL EPOXY RESIN PAVEMENT MARKING SYMBOL - PEDESTRIAN","EACH"]
["T20.3410","FINAL EPOXY RESIN PAVEMENT MARKING WORD (\"ONLY\", \"STOP\", \"YIELD\", \"AHEAD\", \"XING\", \"SCHOOL\", OR OTHER) STANDARD 20.1.0","EACH"]
["T20.3415","FINAL EPOXY RESIN PAVEMENT MARKING SYMBOL SET - HIGHWAY-RAIL GRADE CROSSING (R, X, AND R LETTERS)","EACH"]
["T20.3416","FINAL EPOXY RESIN PAVEMENT MARKING SYMBOL SET - BIKE LANE (HELMETED BICYCLIST AND ARROW)","EACH"]
["T20.3417","FINAL EPOXY RESIN PAVEMENT MARKING SYMBOL SET - SHARED LANE MARKING FOR BICYCLES","EACH"]
["T20.3418","FINAL EPOXY RESIN PAVEMENT MARKING SYMBOL SET - BICYCLE DETECTOR","EACH"]
["T20.3440","PREFORMED THERMOPLASTIC PAVEMENT MARKING SYMBOL - ELONGATED ROUTE SHIELD (STATE OR U.S. ROUTE)","EACH"]
["T20.3441","PREFORMED THERMOPLASTIC PAVEMENT MARKING SYMBOL - ELONGATED ROUTE SHIELD (INTERSTATE ROUTE)","EACH"]
["T20.3501","INTERIM EPOXY RESIN PAVEMENT MARKING SYMBOL - ARROW (STRAIGHT, LEFT, RIGHT OR COMBINED) STANDARD 20.1.0","EACH"]
["T20.3502","INTERIM EPOXY RESIN PAVEMENT MARKING SYMBOL - ROUNDABOUT APPROACH ARROW (STRAIGHT, LEFT, RIGHT OR COMBINED)","EACH"]
["T20.3503","INTERIM EPOXY RESIN PAVEMENT MARKING SYMBOL - LANE REDUCTION ARROW (LEFT OR RIGHT)","EACH"]
["T20.3505","INTERIM EPOXY RESIN PAVEMENT MARKING SYMBOL - YIELD LINE TRIANGLE (ALL SIZES)","EACH"]
["T20.3507","INTERIM EPOXY RESIN PAVEMENT MARKING SYMBOL - PEDESTRIAN","EACH"]
["T20.3510","INTERIM EPOXY RESIN PAVEMENT MARKING WORD (\"ONLY\", \"STOP\", \"YIELD\", \"AHEAD\", \"XING\", \"SCHOOL\", OR OTHER) STANDARD 20.1.0","EACH"]
["T20.3515","INTERIM EPOXY RESIN PAVEMENT MARKING SYMBOL SET - HIGHWAY-RAIL GRADE CROSSING (R, X, AND R LETTERS)","EACH"]
["T20.3516","INTERIM EPOXY RESIN PAVEMENT MARKING SYMBOL SET - BIKE LANE (HELMETED BICYCLIST AND ARROW)","EACH"]
["T20.3517","INTERIM EPOXY RESIN PAVEMENT MARKING SYMBOL SET - SHARED LANE MARKING FOR BICYCLES","EACH"]
["T20.3518","INTERIM EPOXY RESIN PAVEMENT MARKING SYMBOL SET - BICYCLE DETECTOR","EACH"]
["T20.4004","4 INCH WHITE PREFORMED TAPE PAVEMENT MARKINGS","LF"]
["T20.4006","6 INCH WHITE PREFORMED TAPE PAVEMENT MARKINGS","LF"]
["T20.4008","8 INCH WHITE PREFORMED TAPE PAVEMENT MARKINGS","LF"]
["T20.4012","12 INCH WHITE PREFORMED TAPE PAVEMENT MARKINGS","LF"]
["T20.4104","4 INCH YELLOW PREFORMED TAPE PAVEMENT MARKINGS","LF"]
["T20.4106","6 INCH YELLOW PREFORMED TAPE PAVEMENT MARKINGS","LF"]
["T20.4108","8 INCH YELLOW PREFORMED TAPE PAVEMENT MARKINGS","LF"]
["T20.4112","12 INCH YELLOW PREFORMED TAPE PAVEMENT MARKINGS","LF"]
["T20.4506","REMOVE PAVEMENT MARKING LINE - LESS THAN OR EQUAL TO 6 INCHES WIDE","LF"]
["T20.4508","REMOVE PAVEMENT MARKING LINE - GREATER THAN 6 INCHES WIDE","LF"]
["T20.4511","REMOVE PAVEMENT MARKING SYMBOL - ARROW (STRAIGHT, LEFT, RIGHT OR COMBINED)","EACH"]
["T20.4512","REMOVE PAVEMENT MARKING SYMBOL - ROUNDABOUT APPROACH ARROW (STRAIGHT, LEFT, RIGHT OR COMBINED)","EACH"]
["T20.4513","REMOVE PAVEMENT MARKING SYMBOL - LANE REDUCTION ARROW (LEFT OR RIGHT)","EACH"]
["T20.4515","REMOVE PAVEMENT MARKING SYMBOL - YIELD LINE TRIANGLE (ALL SIZES)","EACH"]
["T20.4517","REMOVE PAVEMENT MARKING SYMBOL - PEDESTRIAN","EACH"]
["T20.4520","REMOVE PAVEMENT MARKING WORD (\"ONLY\", \"STOP\", \"YIELD\", \"AHEAD\", \"XING\", \"SCHOOL\", OR OTHER)","EACH"]
["T20.4525","REMOVE PAVEMENT MARKING SYMBOL SET - HIGHWAY-RAIL GRADE CROSSING (R, X, AND R LETTERS)","EACH"]
["T20.4526","REMOVE PAVEMENT MARKING SYMBOL SET - BIKE LANE (HELMETED BICYCLIST AND ARROW)","EACH"]
["T20.4527","REMOVE PAVEMENT MARKING SYMBOL SET - SHARED LANE MARKING FOR BICYCLES","EACH"]
["T20.4528","REMOVE PAVEMENT MARKING SYMBOL SET - BICYCLE DETECTOR","EACH"]
["T20.4530","REMOVE PAVEMENT MARKING SYMBOL - ELONGATED ROUTE SHIELD","EACH"]
["T21.0100","TEMPORARY CONSTRUCTION ZONE REFLECTIVE PAVEMENT DELINEATION","EACH"]
["105.0300","EQUATABLE ADJUSTMENT FOR NON-CONFORMING WORK","EACH"]
["109.0400","CLAIM RESOLUTION","EACH"]
["110.1040","FAILURE TO COMPLY - SECTION 104","EACH"]
["110.1050","FAILURE TO COMPLY - SECTION 105","EACH"]
["110.1060","FAILURE TO COMPLY - SECTION 106","EACH"]
["110.1070","FAILURE TO COMPLY - SECTION 107","EACH"]
["110.1080","FAILURE TO COMPLY - SECTION 108","EACH"]
["110.2060","FAILURE TO COMPLY - SECTION 206","EACH"]
["110.2070","FAILURE TO COMPLY - SECTION 207","EACH"]
["110.2090","FAILURE TO COMPLY - SECTION 209","EACH"]
["110.2120","FAILURE TO COMPLY - SECTION 212","EACH"]
["110.4010","FAILURE TO COMPLY - SECTION 401","EACH"]
["110.4030","FAILURE TO COMPLY - SECTION 403","EACH"]
["110.4100","FAILURE TO COMPLY - SECTION 410","EACH"]
["110.4130","FAILURE TO COMPLY - SECTION 413","EACH"]
["110.8140","FAILURE TO COMPLY - SECTION 814","EACH"]
["110.9050","FAILURE TO COMPLY - SECTION 905","EACH"]
["110.9070","FAILURE TO COMPLY - SECTION 907","EACH"]
["110.9140","FAILURE TO COMPLY - SECTION 914","EACH"]
["110.9160","FAILURE TO COMPLY - SECTION 916","EACH"]
["110.9220","FAILURE TO COMPLY - SECTION 922","EACH"]
["110.9230","FAILURE TO COMPLY - SECTION 923","EACH"]
["110.9240","FAILURE TO COMLPY - SECTION 924","EACH"]
["110.9250","FAILURE TO COMPLY - SECTION 925","EACH"]
["110.9260","FAILURE TO COMLPY - SECTION 926","EACH"]
["110.9280","FAILURE TO COMPLY - SECTION 928","EACH"]
["110.9290","FAILURE TO COMPLY - SECTION 929","EACH"]
["110.9300","FAILURE TO COMPLY - SECTION 930","EACH"]
["110.9340","FAILURE TO COMPLY - SECTION 934","EACH"]
["110.9370","FAILURE TO COMPLY - SECTION 937","EACH"]
["110.9440","FAILURE TO COMPLY - SECTION 944","EACH"]
["110.9441","FAILURE TO COMPLY - SECTION L02","EACH"]
["110.9442","FAILURE TO COMPLY - SECTION L03","EACH"]
["110.9443","FAILURE TO COMPLY - SECTION L06","EACH"]
["110.9444","FAILURE TO COMPLY - SECTION L07","EACH"]
["110.9445","FAILURE TO COMPLY - SECTION T13","EACH"]
["201.0303","CUTTING, REMOVING, AND DISPOSING ISOLATED TRESS AND STUMPS","EACH"]
["201.0307","PARTIAL REMOVAL AND DISPOSAL OF ISOLATED TREE STUMPS","EACH"]
["201.0417","REMOVAL AND DISPOSAL OF PAVEMENT","SY"]
["201.0435","REMOVE AND DISPOSE CULVERTS","EACH"]
["201.0436","REMOVAL AND DISPOSAL OF CURBING","LF"]
["201.0437","REMOVAL AND DISPOSAL OF DRAINAGE AND UTILITY STRUCTURES","EACH"]
["201.0438","REMOVAL AND DISPOSAL OF FENCES AND RAILINGS","LF"]
["201.0459","REMOVE AND SALVAGE FRAMES, COVERS, OR GRATES","EACH"]
["201.0460","REMOVE AND DISPOSE UNDERGROUND STORAGE TANKS","EACH"]
["201.0461","REMOVE AND DISPOSE ABOVEGROUND STORAGE TANKS","EACH"]
["201.0627","REMOVE AND DISPOSE LIGHT STANDARDS AND FOUNDATIONS","EACH"]
["201.0628","REMOVE AND DISPOSE GROUND MOUNTED SIGN PANEL AND STRUCTURE","EACH"]
["201.0740","LOAD, HAUL, AND DISPOSAL OF SOLID WASTE","TON"]
["202.0900","HANDLE, HAUL, AND STOCKPILE MANAGEMENT OF CONTRAMINATED SOILS AND UNCLASSIFIED SOILS","TON"]
["202.0910","LOAD, HAUL, AND DISPOSE SOIL, TYPE 1","TON"]
["202.0920","LOAD AND HAUL CONTAMINATED SOIL, TYPE 2","TON"]
["202.0921","DISPOSAL OF CONTAMINATED SOIL, TYPE 2","TON"]
["202.0922","DISPOSAL OF CONTAMINATED SOIL, TYPE 2 PRICE ADJUSTMENT","EACH"]
["202.0923","DISPOSAL OF CONTAMINATED SOIL, TYPE 2 PRICE ADJUSTMENT (CREDIT)","EACH"]
["202.0930","LOAD AND HAUL CONTAMINATED SOIL, TYPE 3","TON"]
["202.0931","DISPOSAL OF CONTAMINATED SOIL, TYPE 3","TON"]
["202.0932","DISPOSAL OF CONTAMINATED SOIL, TYPE 3 PRICE ADJUSTMENT","EACH"]
["202.0933","DISPOSAL OF CONTAMINATED SOIL, TYPE 3 PRICE ADJUSTMENT (CREDIT)","EACH"]
["202.0940","LOAD AND HAUL CONTAMINATED SOIL, TYPE 4","TON"]
["202.0941","DISPOSAL OF CONTAMINATED SOIL, TYPE 4","TON"]
["202.0942","DISPOSAL OF CONTAMINATED SOIL, TYPE 4 PRICE ADJUSTMENT","EACH"]
["202.0943","DISPOSAL OF CONTAMINATED SOIL, TYPE 4 PRICE ADJUSTMENT (CREDIT)","EACH"]
["202.0950","LOAD AND HAUL CONTAMINATED SOIL, TYPE 5","EACH"]
["202.0960","LOAD, HAUL, AND DISPOSAL OF OTHER WASTE","TON"]
["202.0961","DISPOSAL OF OTHER WASTE PRICE ADJUSTMENT","EACH"]
["202.0962","DISPOSAL OF OTHER WASTE PRICE ADJUSTMENT (CREDIT)","EACH"]
["205.0220","TRENCH ROCK EXCAVATION - MECHANICAL","CY"]
["205.0230","TRENCH EXCAVATION - ROCK","CY"]
["206.0212","BALED STRAW EROSION CHECKS","LF"]
["206.0221","BALED STRAW EROSION CHECK AND SILT FENCE COMBINED","LF"]
["206.0222","SURFACE EROSION CONTROL MATTING","SY"]
["206.0223","SURFACE EROSION CONTROL HYDRAULIC MULCH STABILIZER","ACRE"]
["208.0102","DEWATERING BASIN","EACH"]
["208.0200","CONTAMINATED GROUNDWATER TREATMENT SYSTEM","EACH"]
["208.0300","DEWATERING","LS"]
["209.0220","SACK INSERT INLET PROTECTION","EACH"]
["211.0200","CONSTRUCTION ACCESSES STANDARD 9.9.0","EACH"]
["212.2200","MAINTENANCE AND CLEANING OF EROSION, SEDIMENT, AND POLLUTION PREVENTION CONTROLS","LS"]
["401.0510","HOT MIX ASPHALT PREPARATION – PARTIAL DEPTH","SY"]
["401.0520","HOT MIX ASPHALT PREPARATION – FULL DEPTH","SY"]
["406.0200","FULL DEPTH RECLAMATION WITH CALCIUM CHLORIDE","SY"]
["408.0301","CLEANING AND SEALING CRACKS IN ASPHALT CONCRETE PAVEMENT","LF"]
["408.0600","CLEANING, ROUTING, AND SEALING CRACKS IN ASPHALT CONCRETE PAVEMENT","LF"]
["409.1000","SAW & SEAL TRANSVERSE JOINTS IN BITUMINOUS CONCRETE PAVEMENT","LF"]
["410.1500","TEMPORARY PATCHING OF POTHOLES","EACH"]
["410.2000","TEMPORARY PATCHING OF TRENCHES","TON"]
["411.0200","PAVER PLACED ELASTOMERIC SURFACE TREATMENT","TON"]
["416.0100","PAY ADJUSTMENTS","EACH"]
["416.0150","PAY ADJUSTMENTS (CREDIT)","EACH"]
["502.2000","CLEANING, SEALING, AND REPAIRING JOINTS AND CRACKS BETWEEN 1/16 INCH AND 1 INCH WIDE IN PCC PAVEMENT","LF"]
["503.1000","REPAIRING DETERIORATED/DAMAGED JOINTS 1” TO 8” WIDE IN FINISHED PCC PAVEMENT","LF"]
["601.3000","CONCRETE STRENGTH CREDIT","EACH"]
["701.0300","REINFORCED CONCRETE PIPE M 170  - ALL SIZES","LF"]
["701.2909","CORRUGATED ALUMINUM CULVERT PIPE M196 (MINIMUM GUAGE) - ALL SIZES","LF"]
["701.4311","SMOOTH INTERIOR CORRUGATED POLYETHYLENE PIPE - ALL SIZES","LF"]
["701.5113","SMOOTH INTERIOR CORRUGATED POLYPROPYLENE PIPE - ALL SIZES","LF"]
["701.5202","DUCTILE IRON WATER PIPE, RESTRAINED JOINT - ALL SIZES","LF"]
["701.5302","DUCTILE IRON WATER PIPE, PUSH-ON JOINT - ALL SIZES","LF"]
["701.5402","DUCTILE IRON WATER PIPE, MECHANICAL JOINT - ALL SIZES","LF"]
["701.6005","DUCTILE IRON SEWER SAFE PIPE - ALL SIZES","LF"]
["701.7611","CORRUGATED ALUMINUM CULVERT PIPE END SECTION - ALL SIZES","EACH"]
["701.7711","REINFORCED CONCRETE PIPE END SECTION STANDARD 2.3.0 - ALL SIZES","EACH"]
["701.8010","DRAINAGE STRUCTURE HOOD","EACH"]
["701.8103","GATE VALVE AND BOX - ALL SIZES","EACH"]
["702.0501","FRAME AND GRATE - ALL SIZES AND TYPES","EACH"]
["702.0502","FRAME AND COVER - ALL SIZES AND TYPES ","EACH"]
["702.0529","INLET STONE - ALL SIZES AND TYPES","EACH"]
["702.0545","APRON STONE - ALL SIZES AND TYPES","EACH"]
["702.1000","MANHOLE, CATCH BASIN, OR DROP INLET ASSEMBLY - (0' - 12' DEPTH)","EACH"]
["702.1100","ADDITIONAL DEPTH OF MANHOLE, CATCH BASIN, OR DROP INLET ASSEMBLY - (OVER 12' DEPTH)","VLF"]
["703.0849","UNDERDRAIN WITH FILTER MATERIAL - ALL TYPES & SIZES","LF"]
["703.0850","COMBINED DRAINS WITH FILTER MATERIAL - ALL TYPES & SIZES","LF"]
["704.0500","RECONSTRUCT DRAINAGE STRUCTURE","EACH"]
["707.0100","ADJUST DRAINAGE OR UTILITY STRUCTURE TO GRADE","EACH"]
["708.9043","ROOT REMOVAL","LF"]
["708.9044","CLEANING AND FLUSHING VERTICAL STRUCTURE","EACH"]
["709.0400","CONCRETE FOR THRUST BLOCKS, HEADWALLS, AND MISC PURPOSES","CY"]
["711.0400","WATERWAY","SY"]
["712.0300","GATE BOX - ALL TYPES","EACH"]
["713.0100","ADJUST CURB STOP OR UTILITY BOX TO GRADE","EACH"]
["803.0350","REMOVAL AND DISPOSAL OF EXISTING CONCRETE MASONRY","CY"]
["804.0510","TIMBER PILES FURNISHED","LF"]
["804.0520","TIMBER PILES DRIVEN","LF"]
["804.0701","PRECAST/PRESTRESSED CONCRETE PILES FURNISHED","LF"]
["804.0702","PRECAST/PRESTRESSED CONCRETE PILES DRIVEN","LF"]
["804.0901","COMPOSITE PILES FURNISHED","LF"]
["804.0902","COMPOSITE PILES DRIVEN","LF"]
["804.1203","PROTECTIVE COATING","LF"]
["804.1211","STEEL PILES FURNISHED","LF"]
["804.1212","STEEL PILES DRIVEN","LF"]
["804.1816","DYNAMIC PILE LOAD TEST","EACH"]
["804.1850","STATIC PILE LOAD TEST","EACH"]
["805.0110","PERMANENT EARTH RETAINING SYSTEMS","SF"]
["806.1010","TIMBER CONSTRUCTION","BF"]
["807.0100","STONE MASONRY","SF"]
["807.0101","CONCRETE BLOCK MASONRY AND/OR BRICK MASONRY","SF"]
["807.0102","CONCRETE BACKING","CY"]
["809.5000","OUT-OF-STATE INSPECTION SERVICES","EACH"]
["815.0100","HIGH PRESSURE WATER CLEANING OF CONCRETE SURFACES","SF"]
["815.0200","HIGH PRESSURE WATER CLEANING OF BRIDGE STRUCTURES","EACH"]
["817.2143","REPAIRS TO STRUCTURAL CONRETE MASONRY WITH INTEGRALLY COLORED CONCRETE OR PATCHING MORTAR","CF"]
["821.0100","SAW & SEALING JOINTS IN ASPHALT CONCRETE PAVEMENT","LF"]
["823.1713","COMPRESSION TYPE NEOPRENE JOINT SEALER","LF"]
["824.2000","STRUCTURAL STEEL","LBS"]
["824.2100","STRUCTURAL STEEL; WAETHERING","LBS"]
["824.2200","WELDED STUD SHEAR CONNECTORS","EACH"]
["825.8050","SURFACE PREPARATION FOR EXISTING STEEL","SF"]
["828.0600","MULTI-ROTATIONAL DISK BEARINGS","EACH"]
["830.1000","METAL BRIDGE RAILING","LF"]
["834.0100","GRANITE CURB FOR BRIDGES","LF"]
["835.0400","SCUPPERS","EACH"]
["839.0300","PARTIAL-DEPTH REMOVAL AND DISPOSAL OF ASPHALT PAVEMENT FROM CONCRETE BRIDGE DECKS","SY"]
["839.0400","FULL DEPTH REMOVAL AND DISPOSAL OF ASPHALT PAVEMENT FROM CONCRETE BRIDGE DECKS","SY"]
["844.0100","MOBILIZATION & DEMOBILIZATION OF MICROPILE EQUIPMENT","LS"]
["844.0200","MICROPILE","EACH"]
["844.0300","VERIFICATION LOAD TEST","EACH"]
["844.0400","PROOF LOAD TEST","EACH"]
["845.0100","DRILLED SHAFT - FURNISH AND INSTALL IN SOIL","LF"]
["845.0200","DRILLED SHAFT - OBSTRUCTION REMOVAL","LF"]
["845.0300","DRILLED SHAFT - FURNISH AND INSTALL ROCK SOCKET","LF"]
["901.1000","STEEL BEAM GUARDRAIL","LF"]
["901.1050","GUARDRAIL CONNECTION TO END POST","EACH"]
["901.1100","STEEL BEAM GUARDRAIL APPROACH END TREATMENT","EACH"]
["901.1200","GUARDRAIL END TREATMENT PLATFORM","EACH"]
["901.1300","STEEL BEAM GUARDRAIL ANCHORAGE TRAILING END SECTIONS","EACH"]
["901.1400","STEEL BEAM GUARDRAIL ENCASED POST FOR SHALLOW INSTALLATION","EACH"]
["902.0300","TENSIONED CABLE GUARDRAIL ","LF"]
["903.0510","FENCE - PERMANENT ALL TYPES AND SIZES","LF"]
["903.0520","FENCE - TEMPORARY ALL TYPES AND SIZES","LF"]
["903.0530","GATE - PERMANENT ALL TYPES AND SIZES","EACH"]
["903.0540","GATE - TEMPORARY ALL TYPES AND SIZES","EACH"]
["903.0550","POST HOLE IN LEDGE FOR RESETTING EXISTING FENCE","EACH"]
["903.0560","FENCE POST ON EXISTING FABRIC","EACH"]
["903.0570","FENCE FABRIC ON EXISTING POSTS","LF"]
["904.0201","POST HOLE IN LEDGE FOR RESETTING EXISTING FENCE","EACH"]
["905.1000","PORTLAND CEMENT CONCRETE SIDEWALKS AND DRIVEWAYS","SY"]
["905.2000","ASPHALT CONCRETE SIDEWALKS AND DRIVEWAYS","SY"]
["906.0310","GRANITE CURB","LF"]
["906.0320","PRECAST CONCRETE CURB","LF"]
["908.0110","RUMBLE STRIP","LF"]
["908.0120","REMOVE AND DISPOSE RUMBLE STRIP","LF"]
["909.0315","F SHAPE CONCRETE BARRIER","LF"]
["912.0106","REMOVE AND REBUILD NEW DRY-LAID STONE WALLS","LF"]
["914.6010","FLAGPERSONS","HR"]
["914.6020","FLAGPERSONS - OVERTIME","HR"]
["916.0100","PERMANENT NARROW CONDITION CRASH CUSHION","EACH"]
["916.0110","TEMPORARY NARROW CONDITION CRASH CUSHION","EACH"]
["916.0120","PERMANENT WIDE CONDITION CRASH CUSHION","EACH"]
["916.0130","TEMPORARY WIDE CONDITION CRASH CUSHION","EACH"]
["916.0200","PERMANENT SHOCK ABSORBING BARRIER MODULES","GRP"]
["916.0210","TEMPORARY SHOCK ABSORBING BARRIER MODULES","GRP"]
["920.0310","RIPRAP R-1, R-2 STANDARD 8.3.0","SY"]
["920.0320","RIPRAP R-3, R-4, R-5 STANDARD 8.3.0","SY"]
["920.0330","RIPRAP R-6, R-7, R-8 STANDARD 8.3.0","SY"]
["926.0300","UNANCHORED BARRIER FOR TEMPORARY TRAFFIC CONTROL ","LF"]
["928.0520","SHADOW OR ADVANCE WARNING VEHICLE WITH CRASH CUSHION AND FLASHING ARROW BOARD","HR"]
["928.0530","SHADOW OR ADVANCE WARNING VEHICLE WITH CRASH CUSHION AND CHANGEABLE MESSAGE SIGN","HR"]
["932.0500","CUTTING AND MATCHING PAVEMENT","LF"]
["935.0300","REMOVING ASPHALT PAVEMENT BY MICRO-MILLING","SY"]
["937.0100","FURNISH, INSTALL, MAINTAIN, AND MOVE TEMPORARY TRAFFIC PROTECTION","LS"]
["938.0100","LIQUID ASPHALT PRICE ADJUSTMENT","EACH"]
["938.0101","LIQUID ASPHALT PRICE ADJUSTMENT (CREDIT)","EACH"]
["938.0200","DIESEL FUEL PRICE ADJUSTMENT","EACH"]
["938.0201","DIESEL FUEL PRICE ADJUSTMENT (CREDIT)","EACH"]
["938.0300","STEEL PRICE ADJUSTMENT","EACH"]
["938.0301","STEEL PRICE ADJUSTMENT (CREDIT)","EACH"]
["943.0300","TRAINEE HOURS","HR"]
["L02.0107","SEEDING","SY"]
["L04.0100","FERTILIZATION OF SEEDED, SODDED, AND GRASSED AREAS","ACRE"]
["L08.0101","TREE AND SHRUB TRIMMING","HR"]
["L10.0102","MANUAL TREE AND SHRUB ROOT PRUNING","LF"]
["T04.5301","14 AWG CONDUCTOR CABLE","LF"]
["T04.5401","18 AWG CONDUCTOR CABLE","LF"]
["T04.6915","STRANDED COPPER CONDUCTOR 600V INSULATION","LF"]
["T05.0101","HANDHOLES","EACH"]
["T05.0321","PULL BOXES","EACH"]
["T06.0101","CONDUIT - FIBERGLASS ON STRUCTURE","LF"]
["T06.0101","CONDUIT - UNDERGROUND","LF"]
["T06.3101","CONDUIT - UNDER EXISTING PAVEMENT","LF"]
["T06.4101","CONDUIT - OVERHEAD","LF"]
["T06.5101","CONDUIT - IN STRUCTURE","LF"]
["T06.7001","EXPANSION COUPLINGS","EACH"]
["T07.0101","133-WATT LED LUMINAIRES","EACH"]
["T07.0102","260-WATT LUMINAIRES","EACH"]
["T12.0208","8-PHASE ACTUATED CONTROLLERS, CABINETS, AND FOUNDATINS","EACH"]
["T12.0216","16-PHASE ACTUATED CONTROLLERS, CABINETS, AND FOUNDATINS","EACH"]
["T12.0300","MODIFY EXISTING TRAFFIC SIGNAL CONTROLLER/CABINET","EACH"]
["T12.0310","TRAFFIC ACUTATED CONTROLLERS","EACH"]
["T13.9010","OPTICAL DETECTOR CONFIRMATION BEACHCON","EACH"]
["T13.9020","OPTICAL DETECTOR","EACH"]
["T14.1000","VEHICULAR AND PEDESTRAIN SIGNAL HEADS","EACH"]
["T15.3000","REFLECTIVE SIGN POST PANEL","EACH"]
["T15.4000","RECTANGULAR RAPID FLASHING BEACHCON ASSEMBLY","EACH"]
["T16.0150","GROUND MOUNTED EXTRUDED ALUMINUM SIGN PANELS","SF"]
["T18.0010","DELINEATORS","EACH"]
["T18.0410","OBJECT MARKERS","EACH"]
["T18.0420","FLEXIBLE DELINEATORS - BARRIER MOUNTED","EACH"]
["T19.0300","MILEPOST MARKER","EACH"]
["T20.0101","PAVEMENT MARKINGS","LF"]
["T20.0102","TEMPORARY PAVEMENT MARKINGS","LS"]
["T20.0103","ARROWS, WORDS,  OR SYMBOLS PAVEMENT MARKINGS","EACH"]

{"sheet":"UOMs - DO NOT EDIT","index":4,"n_rows":36,"n_cols":4,"rows_kept":36,"cut":false,"hidden":false,"merged":[]}
["Mapped PMP Code","PMP UOM Description","OSP Code","OSP UOM Description"]
["ACRE","ACRE","ACR","acre"]
["BBL","BARREL","BLL","barrel (US); (petroleum etc.);"]
["BDAY","Barrel Day","B1","barrel (US); per day"]
["BM","board feet","BFT","board foot"]
["BNDL","Bundle","BE","bundle"]
["CF","CF","FTQ","cubic foot"]
["CH","CONTAINER","CH","container"]
["CI","CI","INQ","cubic inch"]
["CS","CASE","CS","case"]
["CY","CY","YDQ","cubic yard"]
["EACH","EACH","EA","each"]
["GAL","Gallons","GLL","gallon"]
["GRP","Group",10,"group"]
["HLF","Hundred Linear Feet","HL","hundred feet (linear);"]
["HRS","machine hours","HUR","hour"]
["HSY","HUNDRED SQUARE YARDS","HY","hundred yard"]
["KT","KIT","KT","kit"]
["LBS","LBS","LBR","pound"]
["LF","LF","LF","linear foot"]
["LS","LS","LS","lump sum"]
["MBM","Thousand Board Feet","MBF","thousand board feet"]
["MGAL","Thousand Gallons","T6","thousand gallon (US);"]
["MHRS","Man Hours","LH","labour hour"]
["PAIL","PAIL","PL","pail"]
["PBAG","Per Bag","BG","bag"]
["PDAY","Per Day","DAY","day"]
["PMO","Per Month","MON","month"]
["PWK","Per Week","WEE","week"]
["PYR","Per Year","ANN","year"]
["QTR",null,"QTR","quarter (UK)"]
["RM","REAM","RM","ream"]
["SF","Square Foot","FTK","square foot"]
["SHT","SHT","SHT","shipping ton"]
["SY","Square Yard","YDK","square yard"]
["TON","TON","STN","ton (US); or short ton (UK/US);"]

{"sheet":"IMP Types - DO NOT EDIT","index":5,"n_rows":66,"n_cols":2,"rows_kept":66,"cut":false,"hidden":false,"merged":[]}
["IMP Type Code","Description"]
[1,"NEW CONSTRUCTION ROADWAY"]
[3,"RECONSTRUCTION, ADDED CAPACITY"]
[4,"RECONSTRUCTION, NO ADDED CAPACITY"]
[5,"4R MAINTENANCE RESURFACING"]
[6,"4R MAINTENANCE RESTORATION & REHABILITATION"]
[7,"4R MAINTENANCE - RELOCATION"]
[8,"BRIDGE, NEW CONSTRUCTION"]
[10,"BRIDGE REPLACEMENT, ADDED CAPACITY"]
[11,"BRIDGE REPLACEMENT, NO ADDED CAPACITY"]
[13,"BRIDGE REHABILITATION, ADDED CAPACITY"]
[14,"BRIDGE REHABILITATION, NO ADDED CAPACITY"]
[15,"PRELIMINARY ENGINEERING"]
[16,"RIGHT OF WAY"]
[17,"CONSTRUCTION ENGINEERING"]
[18,"PLANNING"]
[19,"RESEARCH"]
[20,"ENVIRONMENTAL ONLY"]
[21,"SAFETY"]
[22,"RAIL/HIGHWAY CROSSING"]
[23,"TRANSIT"]
[24,"TRAFFIC MANAGEMENT /ENGINEERING - HOV"]
[25,"VEHICLE WEIGHT ENFORCEMENT PROGRAM"]
[26,"FERRY BOATS"]
[27,"ADMINISTRATION"]
[28,"FACILITIES FOR PEDESTRIAN AND BICYCLES"]
[29,"ACQUISITION OF SCENIC EASMENTS AND SCENIC HISTORIC SITES"]
[30,"SCENIC OR HISTORIC HIGHWAY PROGRAMS"]
[31,"LANDSCAPING AND OTHER SCENIC BEAUTIFICATION"]
[32,"HISTORIC PRESERVATION"]
[33,"REAHABILITATION AND OPERATION OF HISTORIC TRANSPORTATION BUILDINGS, STUCTURES, OR FACILITIES"]
[34,"PRESERVATION OF ABANDONED RAILWAY CORRIDORS"]
[35,"CONTROL AND REMOVAL OF OUTDOOR ADVERTISING"]
[36,"ARCHAELOGICAL PLANNING & RESEARCH"]
[37,"MITIGATION OF WATER POLLUTION DUE TO HIGHWAY RUNOFF"]
[38,"SAFETY AND EDUCATION FOR PEDESTRIANS/BICYCLISTS"]
[39,"ESTABLISHMENT OF TRANSPORTATION MUSEUMS"]
[40,"SPECIAL BRIDGE"]
[41,"YOUTH CONSERVATION SERVICE"]
[42,"TRAINING"]
[43,"UTILITIES"]
[44,"OTHER"]
[45,"DEBT SERVICE"]
[46,"N/A"]
[47,"Bridge Preservation"]
[48,"Bridge Protection"]
[49,"Bridge Inspection and Bridge related training"]
[50,"New Tunnel"]
[51,"Tunnel Replacement"]
[52,"Tunnel Rehabilitation"]
[53,"Tunnel Preservation Maintenance"]
[54,"Tunnel Protection"]
[55,"Tunnel Inspection and Tunnel Related Training"]
[56,"Other Asset Inspection"]
[57,"Safety Non-Infrastructure"]
[58,"Freight"]
["COX","Cox Communications"]
["EDC1","RIEDC1"]
["EDC2","RIEDC2"]
["ELEC","NGrid Electric"]
["GAS1","NGrid Gas"]
["MCI","MCI Communications"]
["NKW1","N. K. WATER"]
["PDPW","Providence Sanitary Sewers"]
["PWSB","Providence Water"]
["VER","Verizon Telephone"]

{"sheet":"Items","index":6,"n_rows":739,"n_cols":90,"rows_kept":739,"cut":false,"hidden":true,"merged":[[0,0,0,9],[0,10,0,92]]}
["Solicitation Item Data\t\t",null,null,null,null,null,null,null,null,null,"Solicitation Response Options"]
["Group Name","Line Item Number","Actions","Item Short Description*","Item Specification Number","Requested Quantity*","Estimated Unit Price (USD)","UOM","Manufacturer Name","Manufacturer Part Number","Commodity Code","Item Long Description","Delivery Address","Delivery Date","Response Required","Pricing Type","Pricing Factor","Alternatives","Allow Vendor to Specify Alternatives","Allow Vendor to Provide Multiple Proposals","Additional Field Id","Add'l Item Field 1","Add'l Item Field Description 1","Required","Data Type","Visible to bidder","Response Field","Additional Field Id","Add'l Item Field 2","Add'l Item Field Description 2","Required","Data Type","Visible to bidder","Response Field","Additional Field Id","Add'l Item Field 3","Add'l Item Field Description 3","Required","Data Type","Visible to bidder","Response Field","Additional Field Id","Add'l Item Field 4","Add'l Item Field Description 4","Required","Data Type","Visible to bidder","Response Field","Additional Field Id","Add'l Item Field 5","Add'l Item Field Description 5","Required","Data Type","Visible to bidder","Response Field","Additional Field Id","Add'l Item Field 6","Add'l Item Field Description 6","Required","Data Type","Visible to bidder","Response Field","Additional Field Id","Add'l Item Field 7","Add'l Item Field Description 7","Required","Data Type","Visible to bidder","Response Field","Additional Field Id","Add'l Item Field 8","Add'l Item Field Description 8","Required","Data Type","Visible to bidder","Response Field","Additional Field Id","Add'l Item Field 9","Add'l Item Field Description 9","Required","Data Type","Visible to bidder","Response Field","Additional Field Id","Add'l Item Field 10","Add'l Item Field Description 10","Required","Data Type","Visible to bidder","Response Field"]
[null,1,"Add","PORTLAND CEMENT CONCRETE SIDEWALKS AND DRIVEWAYS","905.1000",1,232,"YDK","Not Specified","Not Specified","72141000",null,null,"","Yes","Amount","N/A","Not Specified","Yes","Yes",null,"FAP Number","BHO-013B(001)","N","TEXT","N","N",null,"FHWA %",90,"N","PERCENTAGE","N","N",null,"State %",10,"N","PERCENTAGE","N","N",null,"Other %",0,"N","PERCENTAGE","N","N",null,"IMP Type",6,"N","TEXT","N","N"]
[null,2,"Add","SACK INSERT CATCH BASIN INLET PROTECTION","209.0200",2,123.43,"EA","Not Specified","Not Specified","72141000",null,null,"","Yes","Amount","N/A","Not Specified","Yes","Yes",null,"FAP Number","BHO-013B(001)","N","TEXT","N","N",null,"FHWA %",90,"N","PERCENTAGE","N","N",null,"State %",10,"N","PERCENTAGE","N","N",null,"Other %",0,"N","PERCENTAGE","N","N",null,"IMP Type",4,"N","TEXT","N","N"]
[null,3,"Add","REMOVE AND DISPOSE CONCRETE CURB","201.0402",1,323.33,"LF","Not Specified","Not Specified","72141000",null,null,"","Yes","Amount","N/A","Not Specified","Yes","Yes",null,"FAP Number","BHO-013B(001)","N","TEXT","N","N",null,"FHWA %",90,"N","PERCENTAGE","N","N",null,"State %",10,"N","PERCENTAGE","N","N",null,"Other %",0,"N","PERCENTAGE","N","N",null,"IMP Type",4,"N","TEXT","N","N"]
[null,4,"Add","Training sessions Job Spec item - Changed","T20.9906",10,324.22000000000003,"BG","Not Specified","Not Specified","72141000",null,null,"","Yes","Amount","N/A","Not Specified","Yes","Yes",null,"FAP Number","BHO-013C(001)","N","TEXT","N","N",null,"FHWA %",80,"N","PERCENTAGE","N","N",null,"State %",20,"N","PERCENTAGE","N","N",null,"Other %",0,"N","PERCENTAGE","N","N",null,"IMP Type",8,"N","TEXT","N","N"]
[]
[]
[]
[]
[]
[]
[]
[]
[]
[]
[]
[]
[]
[]
[]
[]
[]
[]
[]
[]
[]
[]
[]
[]
[]
[]
[]
[]
[]
[]
[]
[]
[]
[]
[]
[]
[]
[]
[]
[]
[]
[]
[]
[]
[]
[]
[]
[]
[]
[]
[]
[]
[]
[]
[]
[]
[]
[]
[]
[]
[]
[]
[]
[]
[]
[]
[]
[]
[]
[]
[]
[]
[]
[]
[]
[]
[]
[]
[]
[]
[]
[]
[]
[]
[]
[]
[]
[]
[]
[]
[]
[]
[]
[]
[]
[]
[]
[]
[]
[]
[]
[]
[]
[]
[]
[]
[]
[]
[]
[]
[]
[]
[]
[]
[]
[]
[]
[]
[]
[]
[]
[]
[]
[]
[]
[]
[]
[]
[]
[]
[]
[]
[]
[]
[]
[]
[]
[]
[]
[]
[]
[]
[]
[]
[]
[]
[]
[]
[]
[]
[]
[]
[]
[]
[]
[]
[]
[]
[]
[]
[]
[]
[]
[]
[]
[]
[]
[]
[]
[]
[]
[]
[]
[]
[]
[]
[]
[]
[]
[]
[]
[]
[]
[]
[]
[]
[]
[]
[]
[]
[]
[]
[]
[]
[]
[]
[]
[]
[]
[]
[]
[]
[]
[]
[]
[]
[]
[]
[]
[]
[]
[]
[]
[]
[]
[]
[]
[]
[]
[]
[]
[]
[]
[]
[]
[]
[]
[]
[]
[]
[]
[]
[]
[]
[]
[]
[]
[]
[]
[]
[]
[]
[]
[]
[]
[]
[]
[]
[]
[]
[]
[]
[]
[]
[]
[]
[]
[]
[]
[]
[]
[]
[]
[]
[]
[]
[]
[]
[]
[]
[]
[]
[]
[]
[]
[]
[]
[]
[]
[]
[]
[]
[]
[]
[]
[]
[]
[]
[]
[]
[]
[]
[]
[]
[]
[]
[]
[]
[]
[]
[]
[]
[]
[]
[]
[]
[]
[]
[]
[]
[]
[]
[]
[]
[]
[]
[]
[]
[]
[]
[]
[]
[]
[]
[]
[]
[]
[]
[]
[]
[]
[]
[]
[]
[]
[]
[]
[]
[]
[]
[]
[]
[]
[]
[]
[]
[]
[]
[]
[]
[]
[]
[]
[]
[]
[]
[]
[]
[]
[]
[]
[]
[]
[]
[]
[]
[]
[]
[]
[]
[]
[]
[]
[]
[]
[]
[]
[]
[]
[]
[]
[]
[]
[]
[]
[]
[]
[]
[]
[]
[]
[]
[]
[]
[]
[]
[]
[]
[]
[]
[]
[]
[]
[]
[]
[]
[]
[]
[]
[]
[]
[]
[]
[]
[]
[]
[]
[]
[]
[]
[]
[]
[]
[]
[]
[]
[]
[]
[]
[]
[]
[]
[]
[]
[]
[]
[]
[]
[]
[]
[]
[]
[]
[]
[]
[]
[]
[]
[]
[]
[]
[]
[]
[]
[]
[]
[]
[]
[]
[]
[]
[]
[]
[]
[]
[]
[]
[]
[]
[]
[]
[]
[]
[]
[]
[]
[]
[]
[]
[]
[]
[]
[]
[]
[]
[]
[]
[]
[]
[]
[]
[]
[]
[]
[]
[]
[]
[]
[]
[]
[]
[]
[]
[]
[]
[]
[]
[]
[]
[]
[]
[]
[]
[]
[]
[]
[]
[]
[]
[]
[]
[]
[]
[]
[]
[]
[]
[]
[]
[]
[]
[]
[]
[]
[]
[]
[]
[]
[]
[]
[]
[]
[]
[]
[]
[]
[]
[]
[]
[]
[]
[]
[]
[]
[]
[]
[]
[]
[]
[]
[]
[]
[]
[]
[]
[]
[]
[]
[]
[]
[]
[]
[]
[]
[]
[]
[]
[]
[]
[]
[]
[]
[]
[]
[]
[]
[]
[]
[]
[]
[]
[]
[]
[]
[]
[]
[]
[]
[]
[]
[]
[]
[]
[]
[]
[]
[]
[]
[]
[]
[]
[]
[]
[]
[]
[]
[]
[]
[]
[]
[]
[]
[]
[]
[]
[]
[]
[]
[]
[]
[]
[]
[]
[]
[]
[]
[]
[]
[]
[]
[]
[]
[]
[]
[]
[]
[]
[]
[]
[]
[]
[]
[]
[]
[]
[]
[]
[]
[]
[]
[]
[]
[]
[]
[]
[]
[]
[]
[]
[]
[]
[]
[]
[]
[]
[]
[]
[]
[]
[]
[]
[]
[]
[]
[]
[]
[]
[]
[]
[]
[]
[]
[]
[]
[]
[]
[]
[]
[]
[]
[]
[]
[]
[]
[]
[]
[]
[]
[]
[]
[]
[]
[]
[]
[]
[]
[]
[]
[]
[]
[]
[]
[]
[]
[]
[]
[]
[]
[]
[]
[]
[]
[null,null,null,null,null,null,null,null,null,null,null,null," "]

{"sheet":"LOOK UP - DO NOT DELETE","index":7,"n_rows":4,"n_cols":1,"rows_kept":4,"cut":false,"hidden":true,"merged":[]}
[]
["Item Type"]
["Standard"]
["Job Specification"]