{"text_format":"1","workbook":"xlsx","n_sheets":11,"sheets":["RIDEM SW Application","General Project Information","Worksheet A","Minimum Standards Compliance","Tables","Worksheet B","Plan Contents","pick lists","Review Checklist","RIDOT STU History","Version Notes"],"not_rendered":{"charts":0,"images":4,"macros":1,"external_links":1,"defined_names":2,"comments":2,"pivot_tables":0},"unopened":[],"bounds":{"document_bytes":16777216,"sheet_cells":100000,"rows_first":2000,"rows_last":500,"rows_between":2000,"halvings":0,"cell_chars":16384,"cell_head_chars":4096},"cells_cut":0,"cells_raw":0,"read":"whole","date_system":"1900"}

{"sheet":"RIDEM SW Application","index":0,"n_rows":100,"n_cols":18,"rows_kept":100,"cut":false,"hidden":false,"merged":[[1,12,4,14],[6,1,6,14],[8,1,8,14],[8,17,8,30],[10,1,10,9],[10,10,10,14],[16,2,16,4],[16,5,16,7],[16,8,16,14],[17,2,17,4],[17,5,17,7],[17,8,17,14],[12,11,12,14],[13,11,13,12],[13,13,13,14],[14,2,14,4],[14,5,14,11],[14,12,14,14],[15,2,15,4],[15,5,15,11],[15,12,15,14],[21,6,21,7],[21,8,21,9],[21,11,21,13],[22,2,22,4],[22,5,22,7],[22,8,22,11],[22,12,22,14],[18,2,18,7],[18,8,18,14],[19,2,19,7],[19,8,19,14],[20,2,20,3],[20,4,20,5],[20,6,20,7],[20,8,20,10],[20,11,20,14],[23,5,23,7],[23,12,23,14],[24,1,35,1],[24,2,24,8],[24,9,24,14],[25,2,25,8],[25,9,25,14],[26,2,26,4],[26,5,26,8],[14,1,23,1],[28,2,28,8],[28,9,28,11],[28,13,28,14],[29,2,29,8],[29,9,29,11],[29,13,29,14],[26,9,26,12],[26,13,26,14],[27,2,27,4],[27,5,27,8],[27,9,27,12],[27,13,27,14],[21,2,21,3],[21,4,21,5],[39,2,39,7],[39,8,39,12],[30,2,33,14],[34,2,34,7],[34,8,34,11],[34,12,34,14],[35,2,35,7],[35,8,35,11],[35,12,35,14],[48,1,50,1],[48,13,48,14],[49,2,49,4],[49,5,49,7],[49,8,49,12],[50,2,50,4],[50,5,50,7],[50,8,50,12],[39,13,39,14],[40,2,44,14],[45,2,45,7],[45,8,45,11],[45,12,45,14],[46,2,46,7],[46,8,46,11],[46,12,46,14],[36,1,46,1],[36,2,36,7],[36,8,36,14],[37,2,37,7],[37,8,37,14],[38,2,38,7],[38,8,38,12],[38,13,38,14],[76,11,76,12],[77,9,77,10],[78,1,87,1],[79,8,79,12],[79,13,81,14],[83,8,83,12],[65,13,67,14],[69,3,69,12],[71,2,72,12],[71,13,75,14],[73,3,73,12],[74,8,74,12],[51,1,77,1],[51,2,52,12],[51,13,51,14],[53,2,53,12],[53,13,55,14],[56,3,57,11],[59,13,61,14],[61,3,61,12],[63,2,63,12],[63,13,64,14],[88,1,97,1],[88,2,89,12],[88,13,88,14],[91,13,91,14],[92,4,92,9],[92,13,92,14],[93,13,93,14],[94,13,94,14],[95,4,96,12],[97,4,97,12]]}
[]
[null,null,"RHODE ISLAND DEPARTMENT OF ENVIRONMENTAL MANAGEMENT",null,null,null,null,null,null,null,null,null,"Received by RIDEM\n[DATE STAMP HERE]"]
[null,null,"Office of Water Resources"]
[null,null,"235 Promenade Street, Providence, RI 02908-5767"]
[null,null,"Telephone: 401-222-6820; Rhode Island Relay: 711; FAX: 401-222-6177"]
[]
[null,"Application for Stormwater Construction Permit and Water Quality Certification"]
[]
[null,"Use this form to request a Stormwater Construction Permit or Water Quality Certification (WQC).  [This form replaces the formerly used WQC Program Application; Applications for a Stormwater Discharge System Registration and to Modify a Groundwater or Stormwater Discharge System (GWD/UIC Program); and the RIPDES Notice of Intent (NOI) Stormwater General Permit for Construction Activity (CGP).]  If a Freshwater Wetlands (FWW) Application is required, this form must be submitted in addition to the FWW Application form."]
[]
{"$rows_left_out":91}
{"sheet":"General Project Information","index":1,"n_rows":70,"n_cols":8,"rows_kept":70,"cut":false,"hidden":false,"merged":[[66,0,66,8],[61,0,61,8],[62,1,62,8],[63,1,63,8],[64,1,64,8],[65,1,65,8],[57,1,57,8],[58,2,58,4],[58,6,58,8],[59,1,59,8],[57,0,58,0],[54,3,54,4],[54,5,54,6],[54,7,54,8],[55,0,55,8],[56,1,56,8],[40,1,40,8],[41,1,41,5],[41,6,41,8],[50,0,51,2],[50,3,51,4],[50,5,51,6],[50,7,51,8],[44,0,44,8],[45,1,45,2],[45,4,45,5],[45,7,45,8],[46,1,46,2],[46,4,46,5],[47,0,47,8],[48,0,48,8],[39,7,39,8],[9,6,11,8],[0,0,0,8],[1,0,1,1],[1,6,8,8],[2,0,2,1],[2,2,2,5],[3,2,3,5],[6,2,6,5],[12,6,14,8],[16,0,19,1],[20,0,20,8],[21,0,31,2],[21,3,31,4],[34,2,34,8],[3,0,6,1],[7,0,15,1],[7,2,15,5],[68,0,69,0],[5,2,5,5],[19,3,19,5],[18,3,18,5],[17,3,17,5],[16,3,16,5],[39,1,39,6],[43,1,43,8],[21,5,31,6],[21,7,31,8],[32,0,32,8],[33,0,33,8],[34,0,34,1],[68,1,68,8],[69,1,69,3],[69,4,69,8],[42,1,42,6],[42,7,42,8],[67,1,67,6],[67,7,67,8],[49,3,49,4],[49,5,49,6],[49,7,49,8],[52,0,52,2],[53,0,53,2],[53,3,53,4],[53,5,53,6],[53,7,53,8],[60,1,60,8],[54,0,54,2]]}
["APPENDIX A: STORMWATER MANAGEMENT PLAN CHECKLIST & LID PLANNING REPORT\n(RIDOT Redevelopment Projects Only)"]
["PROJECT NAME:",null,"Enter Here",null,null,null,"RIDEM USE ONLY"]
["PROJECT ID:",null,"Enter Here"]
["PROJECT LOCATION\nInclude a vicinity map/locus map in the site construction plans. ",null,"STREET & HIGHWAY ROUTE NUMBER:"]
[null,null,"Enter Here"]
[null,null,"MUNICIPALITY: "]
[null,null,"Enter Here"]
["BRIEF PROJECT \nDESCRIPTION",null,"Enter Here"]
[]
[null,null,null,null,null,null,"DATE RECEIVED"]
{"$rows_left_out":61}
{"sheet":"Worksheet A","index":2,"n_rows":25,"n_cols":6,"rows_kept":25,"cut":false,"hidden":false,"merged":[[13,4,14,4],[11,5,12,5],[13,5,14,5],[4,3,4,4],[9,0,16,0],[2,0,2,1],[4,0,4,1],[24,0,24,5],[17,0,20,0],[21,0,22,0],[8,0,8,1],[8,3,8,5],[13,1,14,1],[11,1,12,1],[9,1,10,1],[9,3,10,3],[9,4,10,4],[9,5,10,5],[11,3,12,3],[13,3,14,3],[11,4,12,4]]}
["Worksheet A: Stormwater Treatment Goal"]
[]
["Date:                                                                   ",null,"Prepared By: "]
[]
["Project ID:                                                                 ",null,"Location:","Municipality:"]
[]
["Instructions: Enter data in unshaded boxes. "]
[]
[null,null,"Project Information","Stormwater Treatment Information  "]
["Input \nreceiving waterbody information.\n1) Steps correlate to those in Section 1.1.2 of the Linear Stormwater Manual. ","A","Step 3.1(b): Enter Waterbody ID (WBID) per the"]
{"$rows_left_out":16}
{"sheet":"Minimum Standards Compliance","index":3,"n_rows":108,"n_cols":3,"rows_kept":108,"cut":false,"hidden":false,"merged":[[105,1,105,2],[106,1,106,2],[107,1,107,2],[99,1,99,2],[100,1,100,2],[101,1,101,2],[102,1,102,2],[103,1,103,2],[104,1,104,2],[98,1,98,2],[82,0,82,2],[83,0,83,2],[87,0,87,2],[89,0,89,2],[90,1,90,2],[92,1,92,2],[93,1,93,2],[94,1,94,2],[95,1,95,2],[96,1,96,2],[97,1,97,2],[91,1,91,2],[84,1,84,2],[85,1,85,2],[86,1,86,2],[81,0,81,2],[70,0,70,2],[71,0,71,2],[72,1,72,2],[73,1,73,2],[74,1,74,2],[75,1,75,2],[76,1,76,2],[77,1,77,2],[78,1,78,2],[79,0,79,2],[80,0,80,2],[69,0,69,2],[57,0,57,2],[58,1,58,2],[59,1,59,2],[60,1,60,2],[61,0,61,2],[62,0,62,2],[63,0,63,2],[64,0,64,2],[65,1,65,2],[67,1,67,2],[68,0,68,2],[66,1,66,2],[32,0,32,1],[33,0,35,0],[33,1,35,1],[33,2,35,2],[56,1,56,2],[45,0,45,2],[46,0,46,2],[47,0,47,2],[48,0,48,2],[49,1,49,2],[50,1,50,2],[51,0,51,2],[52,0,52,2],[53,1,53,2],[54,1,54,2],[55,1,55,2],[41,1,41,2],[19,0,19,1],[20,0,20,1],[20,2,21,2],[22,0,22,1],[23,2,28,2],[24,0,24,1],[26,0,27,0],[36,0,36,2],[37,0,37,1],[38,1,38,2],[39,1,39,2],[40,0,40,2],[29,0,29,2],[30,0,30,2],[31,0,31,2],[17,0,17,1],[17,2,18,2],[0,0,0,2],[1,0,1,2],[2,0,2,2],[3,0,3,1],[4,0,4,1],[4,2,8,2],[5,0,6,0],[9,0,9,1],[9,2,13,2],[10,0,10,1],[14,0,14,1],[16,0,16,1]]}
["PART 2: MINIMUM STANDARD 1 "]
["Relates to Study & Development of Stormwater Management (WBS 1.14)"]
["Low Impact Development (LID) Assessment"]
["Preservation of Undisturbed Area, Buffers & Floodplains",null,"If not implemented - explain here:"]
["Relates to Step 3.1 of Study & Development of Stormwater Management",null,"Enter here. "]
[null,"Are sensitive resource areas within the project LOD? Refer to the:"]
[null,"Environmental Resource Map of the RIDEM Map Room"]
[null,"If answering yes to the question above: have resource area boundaries been field verified? "]
[null,"If answering yes to the question above: Will all vegetated buffers and coastal and freshwater wetlands be protected during and after construction?"]
["Locate Development in Less Sensitive Areas and Work with the Natural Landscape, Hydrology & Soils",null,"If not implemented - explain here:\nEnter here. \n"]
{"$rows_left_out":99}
{"sheet":"Tables","index":4,"n_rows":45,"n_cols":10,"rows_kept":45,"cut":false,"hidden":false,"merged":[[44,0,44,9],[32,9,35,9],[33,2,35,2],[33,3,35,3],[32,7,35,7],[32,8,35,8],[32,2,32,3],[32,5,35,5],[32,6,35,6],[32,4,35,4],[36,0,36,1],[32,0,35,1],[37,0,37,1],[38,0,38,1],[39,0,39,1],[40,0,40,1],[0,0,0,9],[1,0,1,9],[3,2,3,3],[3,4,3,5],[3,6,3,7],[3,8,3,9],[2,5,2,7],[2,0,2,4],[3,0,4,1],[31,2,31,9],[26,0,26,9],[27,0,27,9],[28,0,28,9],[22,3,22,4],[16,3,16,4],[17,3,17,4],[18,3,18,4],[23,3,23,4],[24,3,24,4],[41,0,41,1],[42,0,42,1],[43,0,43,1],[31,0,31,1],[10,0,10,1],[11,0,11,1],[12,0,12,1],[14,0,14,9],[29,5,29,9],[30,0,30,4],[30,5,30,9],[29,0,29,4],[19,3,19,4],[20,3,20,4],[21,3,21,4],[15,0,15,9],[5,0,5,1],[6,0,6,1],[7,0,7,1],[8,0,8,1],[9,0,9,1]]}
["Table 5-1 Hydrologic Analysis Summary "]
["Relates to Minimum Standard 5: Overbank Flood Protection & Other Potential High Flows"]
["Runoff Method Applied for 1.2\" Water Quality Event:"]
["STU ID",null,"1.2\" Peak Flow",null,"1-yr. Peak Flow",null,"10-yr. Peak Flow",null,"100-yr. Peak Flow"]
[null,null,"Pre (cfs)","Post (cfs)","Pre (cfs)","Post (cfs)","Pre (cfs)","Post (cfs)","Pre (cfs)","Post (cfs)"]
[]
[]
[]
[]
[]
{"$rows_left_out":36}
{"sheet":"Worksheet B","index":5,"n_rows":23,"n_cols":6,"rows_kept":23,"cut":false,"hidden":false,"merged":[[11,0,15,0],[21,0,21,5],[4,3,4,4],[2,0,2,1],[4,0,4,1],[9,0,10,0],[8,0,8,1],[8,3,8,5]]}
["Worksheet B: Treatment Provided by STUs"]
[]
["Date:                                                                   ",null,"Prepared By: "]
[]
["Project ID:                                                                 ",null,"Location:","Municipality:"]
[]
["Instructions: Enter data in unshaded boxes. "]
[]
["PART 1 ",null,"Project Information","Stormwater Treatment Information  "]
["Information from Worksheet A. ","A","Waterbody ID (WBID)",{"$f":"IF('Worksheet A'!D10=\"\",\"\",'Worksheet A'!D10)","v":""},{"$f":"IF('Worksheet A'!E10=\"\",\"\",'Worksheet A'!E10)","v":""},{"$f":"IF('Worksheet A'!F10=\"\",\"\",'Worksheet A'!F10)","v":""}]
{"$rows_left_out":14}
{"sheet":"Plan Contents","index":6,"n_rows":44,"n_cols":2,"rows_kept":44,"cut":false,"hidden":false,"merged":[[13,0,13,1],[22,0,22,1],[32,0,32,1],[41,0,41,1],[0,0,0,1],[1,0,1,1],[2,0,2,1],[3,0,3,1],[11,0,11,1],[12,0,12,1]]}
["PART 3: SUBWATERSHED MAPPING AND SITE PLAN DETAILS "]
["Relates to Final Design of Stormwater Management (WBS 2.04) "]
["Existing & Proposed Subwatershed Mapping"]
["Include the following elements on the existing and proposed subwatershed plans (select all that have been provided):"]
[null,"Plans: 24-inch by 36-inch with a usable scale "]
[null,"Drainage area boundaries: based on delineations; incorporate off-site areas that contribute to the project site (labels shall include area of drainage boundary and curve number)"]
[null,"Streams & drainage swales: location, elevation data, cross sections, profiles, method of stabilization"]
[null,"Drainage flow paths: mapped according to Appendix K of the RISDISM; include time of concentration values"]
[null,"Design points: locations, type (e.g., property boundary, drainage system, etc.)"]
[null,"STUs: type, location, dimensions, grading, elevation data; STU labels must correspond to other submittals"]
{"$rows_left_out":35}
{"sheet":"pick lists","index":7,"n_rows":41,"n_cols":45,"rows_kept":41,"cut":false,"hidden":true,"merged":[]}
["City/Town","Permit Type for Modification","Federal Permit Type","Permit Type","App Type ","Fee","WBClass","WBClass","WBClass Description","Water Quality Regulations Appendix A",null,null,null,null,null,null,null,null,null,null,null,null,null,null,null,null,null,null,null,null,null,null,null,null,null,null,null,null,null,null,null,null,null,null,"Scoping"]
["Click to Select","STW/WQC","Click to Select One:","Click HERE to Select","Renewal",100,"Click to Select",null,null,"http://www.dem.ri.gov/pubs/regs/regs/water/h20q09a.pdf",null,null,null,null,null,null,null,null,null,null,null,null,null,null,null,null,null,null,null,null,null,null,null,null,null,null,null,null,null,null,null,null,null,null,"Design/build scope"]
["Barrington","Wetlands","RI CRMC Jurisdiction","Freshwater Wetlands","Transfer",200,"AA","Freshwaters",null,null,null,null,null,null,null,null,null,null,null,null,null,null,null,null,null,null,null,null,null,null,null,null,null,null,null,null,null,null,null,null,null,null,null,null,"10% Initial Review"]
["Bristol","WQC","Freshwater Wetlands Individual Permit (IP)","Water Quality Certification",null,null,"AA@","Class AA@","These waters are designated as a source of public drinking water supply (PDWS) or as tributary waters within a public drinking water supply watershed (the terminal reservoir of the PDWS are identified in Appendix A), for primary and secondary contact recreational activities and for fish and wildlife habitat. These waters shall have excellent aesthetic value.",null,null,null,null,null,null,null,null,null,null,null,null,null,null,null,null,null,null,null,null,null,null,null,null,null,null,null,null,null,null,null,null,null,null,null,"30% Intermediate Review"]
["Burrillville","GWD/UIC",null,"GWD/UIC",null,null,"A","Class A","These waters are designated for primary and secondary contact recreational activities and for fish and wildlife habitat. They shall be suitable for compatible industrial processes and cooling, hydropower, aquacultural uses, navigation, and irrigation and other agricultural uses. These waters shall have excellent aesthetic value.",null,null,null,null,null,null,null,null,null,null,null,null,null,null,null,null,null,null,null,null,null,null,null,null,null,null,null,null,null,null,null,null,null,null,null,"90% Pre-Final Review"]
["Central Falls","RIPDES",null,"RIPDES",null,null,"B","Class B*","These waters are designated for fish and wildlife habitat and primary and secondary contact recreational activities. They shall be suitable for compatible industrial processes and cooling, hydropower, aquacultural uses, navigation, and irrigation and other agricultural uses. These waters shall have good aesthetic value.",null,null,null,null,null,null,null,null,null,null,null,null,null,null,null,null,null,null,null,null,null,null,null,null,null,null,null,null,null,null,null,null,null,null,null,"Final PS&E (100%)"]
["Charlestown",null,"Fill Waters of the State","Stormwater Engineering",null,null,"B*","Class B1*","These waters are designated for primary and secondary contact recreational activities and fish and wildlife habitat. They shall be suitable for compatible industrial processes and cooling, hydropower, aquacultural uses, navigation, and irrigation and other agricultural uses. These waters shall have good aesthetic value. Primary contact recreational activities may be impacted due to pathogens from approved wastewater discharges. However all Class B criteria must be met.",null,null,null,null,null,null,null,null,null,null,null,null,null,null,null,null,null,null,null,null,null,null,null,null,null,null,null,null,null,null,null,null,null,null,null,"Pre-Con Conference"]
["Coventry",null,"Click to Select One:",null,null,null,"B1","Class C","These waters are designated for secondary contact recreational activities and fish and wildlife habitat. They shall be suitable for compatible industrial processes and cooling, hydropower, aquacultural uses, navigation, and irrigation and other agricultural uses. These water shall have good aesthetic value.",null,null,null,null,null,null,null,null,null,null,null,null,null,null,null,null,null,null,null,null,null,null,null,null,null,null,null,null,null,null,null,null,null,null,null,"Active Construction"]
["Cranston",null,"Programmatic General Permit (PGP) Eligible",null,null,null,"B1*","@","Class AA waters used for public drinking water supply may be subject to restricted recreational use by State and local authorities.",null,null,null,null,null,null,null,null,null,null,null,null,null,null,null,null,null,null,null,null,null,null,null,null,null,null,null,null,null,null,null,null,null,null,null,"Final Inspection & Comments"]
["Cumberland",null,"Individual Permit (IP) Required",null,null,null,"C","* ","Certain Class B and B1 waterbody segments may have partial use designations assigned to them as noted in rule 8.B.(3) and described below.",null,null,null,null,null,null,null,null,null,null,null,null,null,null,null,null,null,null,null,null,null,null,null,null,null,null,null,null,null,null,null,null,null,null,null,"Coordination"]
{"$rows_left_out":32}
{"sheet":"Review Checklist","index":8,"n_rows":57,"n_cols":11,"rows_kept":57,"cut":false,"hidden":false,"merged":[[3,0,3,2],[3,3,3,4],[0,0,0,6],[1,0,1,2],[2,0,2,2],[7,1,7,2],[4,0,4,2],[4,3,4,4],[5,0,5,2],[5,3,5,4],[6,0,6,2]]}
["Office of Stormwater Management (OSM) Review Checklist - RIDOT USE ONLY",null,null,null,null,null,null,null,{"$f":"IF('General Project Information'!F53=\"\",'General Project Information'!D53,IF('General Project Information'!H53=\"\",_xlfn.CONCAT('General Project Information'!D53, \", \",'General Project Information'!F53),_xlfn.CONCAT('General Project Information'!D53, \", \", 'General Project Information'!F53, \", \", 'General Project Information'!H53)))","v":"Enter Here, Enter Here, Enter Here"}]
["Project Title:",null,null,"Enter Here",null,null,null,null,{"$f":"IF(SUM('Worksheet A'!D19:F19)>43560,\">1 acre (requires RIPDES permit)\",\"<1 acre\")","v":"<1 acre"}]
["FAP #",null,null,null,null,"Area of Disturbance: (circle)","<1 acre",null,{"$f":"IF('Worksheet A'!D17=\"Yes\",'Worksheet A'!D10,\"\")","v":""},{"$f":"IF('Worksheet A'!E17=\"Yes\",'Worksheet A'!E10,\"\")","v":""},{"$f":"IF('Worksheet A'!F17=\"Yes\",'Worksheet A'!F10,\"\")","v":""}]
["RIDOT PM:",null,null,null,null,null,null,null,{"$f":"_xlfn.CONCAT(I3, \" \", J3, \" \", K3)","v":"  "}]
["OSM Reviewer:",null,null,null,null,"Review Type:"]
["OSM Signoff:",null,null,null,null,"Status:"]
["WBIDs:",null,null,"Enter Here, Enter Here, Enter Here",null,"SCP:","  "]
[null,"State Road:",null,"Enter Here"]
[]
[null,"Y/N/NA","Item","Docs.","Description","Stormwater Review Comment","Comment Addressed"]
{"$rows_left_out":48}
{"sheet":"RIDOT STU History","index":9,"n_rows":13,"n_cols":51,"rows_kept":13,"cut":false,"hidden":false,"merged":[]}
[null,"RIDOT STU History - RIDOT USE ONLY"]
["Infil Rate","STU Name","Legacy ID","TIP ID","Waterbody ID","STU Progress","Progress Date","Consultant","STU Type","STU Soil Type","STU Storage Volume (cuft)","Treatment Depth (inches)","Catchment Area (sqft)","RIDOT Catchment Area (sqft)","Impervious Area of STU catchment (sqft)","RIDOT Impervious Area of STU catchment (sqft)","TP Load (lb/year)","RIDOT TP Load (lb/year)","TP Removal (%)","TP Removal (lb/year)","RIDOT TP Removal (lb/year)","TN Load (lb/year)","RIDOT TN Load (lb/year)","TN Removal (%)","TN Removal (lb/year)","RIDOT TN Removal (lb/year)","TSS Load (lb/year)","RIDOT TSS Load (lb/year)","TSS Removal (%)","TSS Removal (lb/year)","RIDOT TSS Removal (lb/year)","Zinc Load (lb/year)","RIDOT ZN Load (lb/year)","Zinc Removal (%)","Zinc Removal (lb/year)","RIDOT ZN Removal (lb/year)","Effective IC Reduction (acres)","RIDOT Effective IC Reduction (acres)","IC Removal (%)","Runoff Reduction (acft)","Runoff Factor","Flow Factor","TP Factor","TSS Factor","Cost","Cost per Acre IC","Cost per Lb Phosphorus","SCP Priority","Latitude","Longitude","Notes"]
[{"$f":"IF(B3=\"\",\"\",VLOOKUP(B3,Tables!$A$37:$J$44,9))","v":""},{"$f":"IF(Tables!A18=\"\",\"\",Tables!A18)","v":""},null,null,{"$f":"IF(B3=\"\",\"\",VLOOKUP(B3,Tables!$A$18:$J$25,2))","v":""},null,null,{"$f":"IF(B3=\"\",\"\",'General Project Information'!$D$17)","v":""},{"$f":"IF(B3=\"\",\"\",VLOOKUP(B3,Tables!$A$18:$J$25,3))","v":""},{"$f":"IF(B3=\"\",\"\",Soiltype(A3))","v":""},{"$f":"IF(B3=\"\",\"\",VLOOKUP(B3,Tables!$A$18:$J$25,8))","v":""},{"$f":"IF(B3=\"\",\"\",VLOOKUP(B3,Tables!$A$18:$J$25,9))","v":""},{"$f":"IF(B3=\"\",\"\",SUM(VLOOKUP(B3,Tables!$A$18:$J$25,5),VLOOKUP(B3,Tables!$A$18:$J$25,6)))","v":""},null,{"$f":"IF(B3=\"\",\"\",VLOOKUP(B3,Tables!$A$18:$J$25,5))","v":""}]
[{"$f":"IF(B4=\"\",\"\",VLOOKUP(B4,Tables!$A$37:$J$44,9))","v":""},{"$f":"IF(Tables!A19=\"\",\"\",Tables!A19)","v":""},null,null,{"$f":"IF(B4=\"\",\"\",VLOOKUP(B4,Tables!$A$18:$J$25,2))","v":""},null,null,{"$f":"IF(B4=\"\",\"\",'General Project Information'!$D$17)","v":""},{"$f":"IF(B4=\"\",\"\",VLOOKUP(B4,Tables!$A$18:$J$25,3))","v":""},{"$f":"IF(B4=\"\",\"\",Soiltype(A4))","v":""},{"$f":"IF(B4=\"\",\"\",VLOOKUP(B4,Tables!$A$18:$J$25,8))","v":""},{"$f":"IF(B4=\"\",\"\",VLOOKUP(B4,Tables!$A$18:$J$25,9))","v":""},{"$f":"IF(B4=\"\",\"\",SUM(VLOOKUP(B4,Tables!$A$18:$J$25,5),VLOOKUP(B4,Tables!$A$18:$J$25,6)))","v":""},null,{"$f":"IF(B4=\"\",\"\",VLOOKUP(B4,Tables!$A$18:$J$25,5))","v":""}]
[{"$f":"IF(B5=\"\",\"\",VLOOKUP(B5,Tables!$A$37:$J$44,9))","v":""},{"$f":"IF(Tables!A20=\"\",\"\",Tables!A20)","v":""},null,null,{"$f":"IF(B5=\"\",\"\",VLOOKUP(B5,Tables!$A$18:$J$25,2))","v":""},null,null,{"$f":"IF(B5=\"\",\"\",'General Project Information'!$D$17)","v":""},{"$f":"IF(B5=\"\",\"\",VLOOKUP(B5,Tables!$A$18:$J$25,3))","v":""},"",{"$f":"IF(B5=\"\",\"\",VLOOKUP(B5,Tables!$A$18:$J$25,8))","v":""},{"$f":"IF(B5=\"\",\"\",VLOOKUP(B5,Tables!$A$18:$J$25,9))","v":""},{"$f":"IF(B5=\"\",\"\",SUM(VLOOKUP(B5,Tables!$A$18:$J$25,5),VLOOKUP(B5,Tables!$A$18:$J$25,6)))","v":""},null,{"$f":"IF(B5=\"\",\"\",VLOOKUP(B5,Tables!$A$18:$J$25,5))","v":""}]
[{"$f":"IF(B6=\"\",\"\",VLOOKUP(B6,Tables!$A$37:$J$44,9))","v":""},{"$f":"IF(Tables!A21=\"\",\"\",Tables!A21)","v":""},null,null,{"$f":"IF(B6=\"\",\"\",VLOOKUP(B6,Tables!$A$18:$J$25,2))","v":""},null,null,{"$f":"IF(B6=\"\",\"\",'General Project Information'!$D$17)","v":""},{"$f":"IF(B6=\"\",\"\",VLOOKUP(B6,Tables!$A$18:$J$25,3))","v":""},"",{"$f":"IF(B6=\"\",\"\",VLOOKUP(B6,Tables!$A$18:$J$25,8))","v":""},{"$f":"IF(B6=\"\",\"\",VLOOKUP(B6,Tables!$A$18:$J$25,9))","v":""},{"$f":"IF(B6=\"\",\"\",SUM(VLOOKUP(B6,Tables!$A$18:$J$25,5),VLOOKUP(B6,Tables!$A$18:$J$25,6)))","v":""},null,{"$f":"IF(B6=\"\",\"\",VLOOKUP(B6,Tables!$A$18:$J$25,5))","v":""}]
[{"$f":"IF(B7=\"\",\"\",VLOOKUP(B7,Tables!$A$37:$J$44,9))","v":""},{"$f":"IF(Tables!A22=\"\",\"\",Tables!A22)","v":""},null,null,{"$f":"IF(B7=\"\",\"\",VLOOKUP(B7,Tables!$A$18:$J$25,2))","v":""},null,null,{"$f":"IF(B7=\"\",\"\",'General Project Information'!$D$17)","v":""},{"$f":"IF(B7=\"\",\"\",VLOOKUP(B7,Tables!$A$18:$J$25,3))","v":""},"",{"$f":"IF(B7=\"\",\"\",VLOOKUP(B7,Tables!$A$18:$J$25,8))","v":""},{"$f":"IF(B7=\"\",\"\",VLOOKUP(B7,Tables!$A$18:$J$25,9))","v":""},{"$f":"IF(B7=\"\",\"\",SUM(VLOOKUP(B7,Tables!$A$18:$J$25,5),VLOOKUP(B7,Tables!$A$18:$J$25,6)))","v":""},null,{"$f":"IF(B7=\"\",\"\",VLOOKUP(B7,Tables!$A$18:$J$25,5))","v":""}]
[{"$f":"IF(B8=\"\",\"\",VLOOKUP(B8,Tables!$A$37:$J$44,9))","v":""},{"$f":"IF(Tables!A23=\"\",\"\",Tables!A23)","v":""},null,null,{"$f":"IF(B8=\"\",\"\",VLOOKUP(B8,Tables!$A$18:$J$25,2))","v":""},null,null,{"$f":"IF(B8=\"\",\"\",'General Project Information'!$D$17)","v":""},{"$f":"IF(B8=\"\",\"\",VLOOKUP(B8,Tables!$A$18:$J$25,3))","v":""},"",{"$f":"IF(B8=\"\",\"\",VLOOKUP(B8,Tables!$A$18:$J$25,8))","v":""},{"$f":"IF(B8=\"\",\"\",VLOOKUP(B8,Tables!$A$18:$J$25,9))","v":""},{"$f":"IF(B8=\"\",\"\",SUM(VLOOKUP(B8,Tables!$A$18:$J$25,5),VLOOKUP(B8,Tables!$A$18:$J$25,6)))","v":""},null,{"$f":"IF(B8=\"\",\"\",VLOOKUP(B8,Tables!$A$18:$J$25,5))","v":""}]
[{"$f":"IF(B9=\"\",\"\",VLOOKUP(B9,Tables!$A$37:$J$44,9))","v":""},{"$f":"IF(Tables!A24=\"\",\"\",Tables!A24)","v":""},null,null,{"$f":"IF(B9=\"\",\"\",VLOOKUP(B9,Tables!$A$18:$J$25,2))","v":""},null,null,{"$f":"IF(B9=\"\",\"\",'General Project Information'!$D$17)","v":""},{"$f":"IF(B9=\"\",\"\",VLOOKUP(B9,Tables!$A$18:$J$25,3))","v":""},"",{"$f":"IF(B9=\"\",\"\",VLOOKUP(B9,Tables!$A$18:$J$25,8))","v":""},{"$f":"IF(B9=\"\",\"\",VLOOKUP(B9,Tables!$A$18:$J$25,9))","v":""},{"$f":"IF(B9=\"\",\"\",SUM(VLOOKUP(B9,Tables!$A$18:$J$25,5),VLOOKUP(B9,Tables!$A$18:$J$25,6)))","v":""},null,{"$f":"IF(B9=\"\",\"\",VLOOKUP(B9,Tables!$A$18:$J$25,5))","v":""}]
[{"$f":"IF(B10=\"\",\"\",VLOOKUP(B10,Tables!$A$37:$J$44,9))","v":""},{"$f":"IF(Tables!A25=\"\",\"\",Tables!A25)","v":""},null,null,{"$f":"IF(B10=\"\",\"\",VLOOKUP(B10,Tables!$A$18:$J$25,2))","v":""},null,null,{"$f":"IF(B10=\"\",\"\",'General Project Information'!$D$17)","v":""},{"$f":"IF(B10=\"\",\"\",VLOOKUP(B10,Tables!$A$18:$J$25,3))","v":""},"",{"$f":"IF(B10=\"\",\"\",VLOOKUP(B10,Tables!$A$18:$J$25,8))","v":""},{"$f":"IF(B10=\"\",\"\",VLOOKUP(B10,Tables!$A$18:$J$25,9))","v":""},{"$f":"IF(B10=\"\",\"\",SUM(VLOOKUP(B10,Tables!$A$18:$J$25,5),VLOOKUP(B10,Tables!$A$18:$J$25,6)))","v":""},null,{"$f":"IF(B10=\"\",\"\",VLOOKUP(B10,Tables!$A$18:$J$25,5))","v":""}]
{"$rows_left_out":4}
{"sheet":"Version Notes","index":10,"n_rows":3,"n_cols":3,"rows_kept":3,"cut":false,"hidden":false,"merged":[]}
["Version Notes - RIDOT USE ONLY"]
["Date","Updated By","Update"]
["2019-07-22","VHB ","-added tab for the OSM review checklist (Review Checklist).  Adjusted formatting (i.e., merged cells) on other tabs to allow this tab to auto-populate upfront project information.  \n-added tab for RIDOT STU History (pulls information from the Tables tab in the format matching the STU GIS layer so that the data can be easily loaded from this spreadsheet into GIS).\n-updated pick list for BMP Type to match the STU GIS layer domain. \n-added WBID to Table 5-2 (Tables tab)."]